{"text_format":"1","workbook":"xlsx","n_sheets":30,"sheets":["Sommaire","Plateaux techniques AFPA","donnees_brutes","TCD","ARA TCD","ARA","BFC TCD","BFC","Bretagne TCD","Bretagne","CVL TCD","CVL","Corse TCD","Corse","GE TCD","GE","HDF TCD","HdF","IDF TCD","IdF","PdlL TCD","Norm TCD","Norm","NA TCD","NA","PACA TCD","PACA","Occ TCD","PdlL","Occ"],"not_rendered":{"charts":14,"images":10,"macros":1,"external_links":0,"defined_names":114,"comments":0,"pivot_tables":14},"unopened":[],"bounds":{"document_bytes":16777216,"sheet_cells":100000,"rows_first":2000,"rows_last":500,"rows_between":2000,"halvings":0,"cell_chars":16384,"cell_head_chars":4096},"cells_cut":0,"cells_raw":0,"read":"whole","date_system":"1900"}

{"sheet":"Sommaire","index":0,"n_rows":28,"n_cols":3,"rows_kept":28,"cut":false,"hidden":false,"merged":[[27,2,35,17]]}
[]
[]
[]
[]
[]
[]
[]
[]
[]
[]
[]
[]
[]
[]
[]
[]
[]
[]
[]
[]
[]
[]
[]
[]
[]
[]
[]
[null,null,"Nota Bene\nCette cartographie présente les plateaux techniques en activité dans les centres Afpa sur les 18 derniers mois.\nSelon votre recherche, vous pouvez sélectionner une région, un département, un centre ou un secteur d'activité pour voir la liste des plateaux techniques disponibles.\nVous pouvez aussi sélectionner directement une formation dans la liste pour voir les centres qui disposent du plateau technique correspondant.\nAttention, pour toute nouvelle recherche, pensez-bien à supprimer le ou les filtres utilisés en cliquant sur la croix rouge sous le filtre : \nLa programmation des formations pouvant fluctuer, merci de vous rapprocher de votre référent Déclic Afpa pour vérifier la disponibilité de l’atelier découverte métier dans le centre choisi."]

{"sheet":"Plateaux techniques AFPA","index":1,"n_rows":0,"n_cols":0,"rows_kept":0,"cut":false,"hidden":false,"merged":[]}

{"sheet":"donnees_brutes","index":2,"n_rows":2624,"n_cols":12,"rows_kept":2624,"cut":false,"hidden":true,"merged":[]}
["Pays","Provinces","Départements","CENTRE","LIBELLE GRN","SECTEUR D'ACTIVITE","DATE DE DEBUT DE FORMATION","DATE DE FIN DE FORMATION","LIBELLE PRODUIT","LIGNE PRODUIT","NIVEAU\n(V-IV-III-II)","AGE PAR CATEGORIE"]
["France","Auvergne-Rhône-Alpes","Haute-Savoie","Annecy Poisy",null,"Fonctions supports de l'entreprise",null,null,"Secrétaire assistant médico-social"]
["France","Auvergne-Rhône-Alpes","Haute-Savoie","Annecy Poisy",null,"Services aux entreprises et à la personne",null,null,"Secrétaire assistant médico-social"]
["France","Auvergne-Rhône-Alpes","Haute-Savoie","Annecy Poisy",null,"Hôtellerie - restauration - tourisme - loisirs",null,null,"Agent(e) de restauration"]
["France","Auvergne-Rhône-Alpes","Haute-Savoie","Annecy Poisy",null,"Commerce - vente - distribution",null,null,"Employé commercial en magasin"]
["France","Auvergne-Rhône-Alpes","Haute-Savoie","Annecy Poisy",null,"Hôtellerie - restauration - tourisme - loisirs",null,null,"Gouvernant en hôtellerie"]
["France","Auvergne-Rhône-Alpes","Haute-Savoie","Annecy Poisy",null,"Fonctions supports de l'entreprise",null,null,"Formateur professionnel d'adultes"]
["France","Auvergne-Rhône-Alpes","Haute-Savoie","Annecy Poisy",null,"Hôtellerie - restauration - tourisme - loisirs",null,null,"Cuisinier"]
["France","Auvergne-Rhône-Alpes","Haute-Savoie","Annecy Poisy",null,"Fonctions supports de l'entreprise",null,null,"Secrétaire assistant"]
["France","Auvergne-Rhône-Alpes","Haute-Savoie","Annecy Poisy",null,"Hôtellerie - restauration - tourisme - loisirs",null,null,"Réceptionniste en hôtellerie"]
["France","Auvergne-Rhône-Alpes","Haute-Savoie","Annecy Poisy",null,"Insertion et de la médiation",null,null,"Conseiller en insertion professionnelle"]
["France","Auvergne-Rhône-Alpes","Haute-Savoie","Annecy Poisy",null,"Fonctions supports de l'entreprise",null,null,"Gestionnaire de paie"]
["France","Auvergne-Rhône-Alpes","Haute-Savoie","Annecy Poisy",null,"Fonctions supports de l'entreprise",null,null,"Assistant ressources humaines"]
["France","Auvergne-Rhône-Alpes","Haute-Savoie","Annecy Poisy",null,"Fonctions supports de l'entreprise",null,null,"Employé administratif et d’accueil"]
["France","Auvergne-Rhône-Alpes","Haute-Savoie","Annecy Poisy",null,"Services aux entreprises et à la personne",null,null,"Agent de service médico-social"]
["France","Auvergne-Rhône-Alpes","Ain","Bourg en Bresse",null,"Fonctions supports de l'entreprise",null,null,"Secrétaire assistant médico-social"]
["France","Auvergne-Rhône-Alpes","Ain","Bourg en Bresse",null,"Industrie",null,null,"Carrossier réparateur"]
["France","Auvergne-Rhône-Alpes","Ain","Bourg en Bresse",null,"Bâtiment",null,null,"Installateur en thermique et sanitaire"]
["France","Auvergne-Rhône-Alpes","Ain","Bourg en Bresse",null,"Industrie",null,null,"Mécanicien(ne) de maintenance automobile"]
["France","Auvergne-Rhône-Alpes","Ain","Bourg en Bresse",null,"Transports - logistique",null,null,"Conducteur livreur sur véhicule utilitaire léger"]
["France","Auvergne-Rhône-Alpes","Ain","Bourg en Bresse",null,"Bâtiment",null,null,"Plaquiste-plâtrier"]
["France","Auvergne-Rhône-Alpes","Ain","Bourg en Bresse",null,"Fonctions supports de l'entreprise",null,null,"Comptable assistant"]
["France","Auvergne-Rhône-Alpes","Ain","Bourg en Bresse",null,"Services aux entreprises et à la personne",null,null,"Assistant de vie aux familles"]
["France","Auvergne-Rhône-Alpes","Ain","Bourg en Bresse",null,"Industrie",null,null,"Agent de montage et de câblage en électronique"]
["France","Auvergne-Rhône-Alpes","Ain","Bourg en Bresse",null,"Bâtiment",null,null,"Electricien d'équipement du bâtiment"]
["France","Auvergne-Rhône-Alpes","Ain","Bourg en Bresse",null,"Bâtiment",null,null,"Menuisier poseur-installateur"]
["France","Auvergne-Rhône-Alpes","Savoie","Chambéry",null,"Fonctions supports de l'entreprise",null,null,"Secrétaire assistant médico-social"]
["France","Auvergne-Rhône-Alpes","Savoie","Chambéry",null,"Bâtiment",null,null,"Installateur en thermique et sanitaire"]
["France","Auvergne-Rhône-Alpes","Savoie","Chambéry",null,"Hôtellerie - restauration - tourisme - loisirs",null,null,"Agent(e) de restauration"]
["France","Auvergne-Rhône-Alpes","Savoie","Chambéry",null,"Fonctions supports de l'entreprise",null,null,"Formateur professionnel d'adultes"]
["France","Auvergne-Rhône-Alpes","Savoie","Chambéry",null,"Industrie",null,null,"Agent de fabrication industrielle"]
["France","Auvergne-Rhône-Alpes","Savoie","Chambéry",null,"Hôtellerie - restauration - tourisme - loisirs",null,null,"Cuisinier"]
["France","Auvergne-Rhône-Alpes","Savoie","Chambéry",null,"Bâtiment",null,null,"Agent de maintenance des bâtiments"]
["France","Auvergne-Rhône-Alpes","Savoie","Chambéry",null,"Services aux entreprises et à la personne",null,null,"Assistant de vie aux familles"]
["France","Auvergne-Rhône-Alpes","Savoie","Chambéry",null,"Bâtiment",null,null,"Electricien d'équipement du bâtiment"]
["France","Auvergne-Rhône-Alpes","Savoie","Chambéry",null,"Industrie",null,null,"Soudeur assembleur industriel"]
["France","Auvergne-Rhône-Alpes","Puy-de-Dôme","Clermont Beaumont",null,"Bâtiment",null,null,"Monteur dépanneur frigoriste"]
["France","Auvergne-Rhône-Alpes","Puy-de-Dôme","Clermont Beaumont",null,"Fonctions supports de l'entreprise",null,null,"Secrétaire assistant médico-social"]
["France","Auvergne-Rhône-Alpes","Puy-de-Dôme","Clermont Beaumont",null,"Bâtiment",null,null,"Installateur en thermique et sanitaire"]
["France","Auvergne-Rhône-Alpes","Puy-de-Dôme","Clermont Beaumont",null,"Industrie",null,null,"Technicien supérieur de maintenance industrielle"]
["France","Auvergne-Rhône-Alpes","Puy-de-Dôme","Clermont Beaumont",null,"Industrie",null,null,"Electricien d’installation et de maintenance des systèmes automatisés"]
["France","Auvergne-Rhône-Alpes","Puy-de-Dôme","Clermont Beaumont",null,"Transports - logistique",null,null,"Conducteur livreur sur véhicule utilitaire léger"]
["France","Auvergne-Rhône-Alpes","Puy-de-Dôme","Clermont Beaumont",null,"Commerce - vente - distribution",null,null,"Employé technicien-vendeur en matériel de sport"]
["France","Auvergne-Rhône-Alpes","Puy-de-Dôme","Clermont Beaumont",null,"Fonctions supports de l'entreprise",null,null,"Formateur professionnel d'adultes"]
["France","Auvergne-Rhône-Alpes","Puy-de-Dôme","Clermont Beaumont",null,"Insertion et de la médiation",null,null,"Conseiller en insertion professionnelle"]
["France","Auvergne-Rhône-Alpes","Puy-de-Dôme","Clermont Beaumont",null,"Industrie",null,null,"Technicien de maintenance industrielle"]
["France","Auvergne-Rhône-Alpes","Puy-de-Dôme","Clermont Beaumont",null,"Bâtiment",null,null,"Electricien d'équipement du bâtiment"]
["France","Auvergne-Rhône-Alpes","Puy-de-Dôme","Clermont Beaumont",null,"Réseaux - Télécommunications - Informatique - Numérique",null,null,"Développeur web et web mobile"]
["France","Auvergne-Rhône-Alpes","Puy-de-Dôme","Clermont Beaumont",null,"Réseaux - Télécommunications - Informatique - Numérique",null,null,"Concepteur développeur d’applications"]
["France","Auvergne-Rhône-Alpes","Puy-de-Dôme","Clermont Beaumont",null,"Bâtiment",null,null,"Menuisier poseur-installateur"]
["France","Auvergne-Rhône-Alpes","Puy-de-Dôme","Clermont Beaumont",null,"Réseaux - Télécommunications - Informatique - Numérique",null,null,"Technicien supérieur systèmes et réseaux"]
["France","Auvergne-Rhône-Alpes","Puy-de-Dôme","Clermont la Sarre",null,"Bâtiment",null,null,"Peintre en bâtiment"]
["France","Auvergne-Rhône-Alpes","Puy-de-Dôme","Clermont la Sarre",null,"Bâtiment",null,null,"Maçon"]
["France","Auvergne-Rhône-Alpes","Puy-de-Dôme","Clermont la Sarre",null,"Bâtiment",null,null,"Plaquiste-plâtrier"]
["France","Auvergne-Rhône-Alpes","Puy-de-Dôme","Clermont la Sarre",null,"Bâtiment",null,null,"Agent de maintenance des bâtiments"]
["France","Auvergne-Rhône-Alpes","Puy-de-Dôme","Clermont la Sarre",null,"Bâtiment",null,null,"Technicien d'équipement et de maintenance de piscines"]
["France","Auvergne-Rhône-Alpes","Puy-de-Dôme","Clermont la Sarre",null,"Bâtiment",null,null,"Coffreur Bancheur"]
["France","Auvergne-Rhône-Alpes","Puy-de-Dôme","Clermont la Sarre",null,"Bâtiment",null,null,"Conducteur de travaux du bâtiment et du génie civil"]
["France","Auvergne-Rhône-Alpes","Puy-de-Dôme","Clermont la Sarre",null,"Bâtiment",null,null,"BIM modeleur du bâtiment"]
["France","Auvergne-Rhône-Alpes","Isère","Grenoble Pt de Claix",null,"Bâtiment",null,null,"Maçon en voirie et réseaux divers"]
["France","Auvergne-Rhône-Alpes","Isère","Grenoble Pt de Claix",null,"Travaux publics",null,null,"Maçon en voirie et réseaux divers"]
["France","Auvergne-Rhône-Alpes","Isère","Grenoble Pt de Claix",null,"Fonctions supports de l'entreprise",null,null,"Gestionnaire comptable et fiscal"]
["France","Auvergne-Rhône-Alpes","Isère","Grenoble Pt de Claix",null,"Bâtiment",null,null,"Installateur en thermique et sanitaire"]
["France","Auvergne-Rhône-Alpes","Isère","Grenoble Pt de Claix",null,"Hôtellerie - restauration - tourisme - loisirs",null,null,"Agent(e) de restauration"]
["France","Auvergne-Rhône-Alpes","Isère","Grenoble Pt de Claix",null,"Industrie",null,null,"Conducteur d'installation et de machines automatisées"]
["France","Auvergne-Rhône-Alpes","Isère","Grenoble Pt de Claix",null,"Commerce - vente - distribution",null,null,"Employé commercial en magasin"]
["France","Auvergne-Rhône-Alpes","Isère","Grenoble Pt de Claix",null,"Bâtiment",null,null,"Maçon"]
["France","Auvergne-Rhône-Alpes","Isère","Grenoble Pt de Claix",null,"Industrie",null,null,"Technicien supérieur de maintenance industrielle"]
["France","Auvergne-Rhône-Alpes","Isère","Grenoble Pt de Claix",null,"Bâtiment",null,null,"Technicien d’équipement et d’exploitation en électricité"]
["France","Auvergne-Rhône-Alpes","Isère","Grenoble Pt de Claix",null,"Transports - logistique",null,null,"Conducteur livreur sur véhicule utilitaire léger"]
["France","Auvergne-Rhône-Alpes","Isère","Grenoble Pt de Claix",null,"Commerce - vente - distribution",null,null,"Employé technicien-vendeur en matériel de sport"]
["France","Auvergne-Rhône-Alpes","Isère","Grenoble Pt de Claix",null,"Industrie",null,null,"Agent de fabrication industrielle"]
["France","Auvergne-Rhône-Alpes","Isère","Grenoble Pt de Claix",null,"Bâtiment",null,null,"Agent de maintenance des bâtiments"]
["France","Auvergne-Rhône-Alpes","Isère","Grenoble Pt de Claix",null,"Services aux entreprises et à la personne",null,null,"Assistant de vie aux familles"]
["France","Auvergne-Rhône-Alpes","Isère","Grenoble Pt de Claix",null,"Insertion et de la médiation",null,null,"Conseiller en insertion professionnelle"]
["France","Auvergne-Rhône-Alpes","Isère","Grenoble Pt de Claix",null,"Industrie",null,null,"Technicien de maintenance industrielle"]
["France","Auvergne-Rhône-Alpes","Isère","Grenoble Pt de Claix",null,"Insertion et de la médiation",null,null,"Encadrant technique d'insertion"]
["France","Auvergne-Rhône-Alpes","Isère","Grenoble Pt de Claix",null,"Travaux publics",null,null,"Canalisateur"]
["France","Auvergne-Rhône-Alpes","Isère","Grenoble Pt de Claix",null,"Bâtiment",null,null,"Electricien d'équipement du bâtiment"]
["France","Auvergne-Rhône-Alpes","Isère","Grenoble Pt de Claix",null,"Réseaux - Télécommunications - Informatique - Numérique",null,null,"Technicien d'assistance en informatique"]
["France","Auvergne-Rhône-Alpes","Isère","Grenoble Pt de Claix",null,"Fonctions supports de l'entreprise",null,null,"Gestionnaire de paie"]
["France","Auvergne-Rhône-Alpes","Isère","Grenoble Pt de Claix",null,"Fonctions supports de l'entreprise",null,null,"Assistant ressources humaines"]
["France","Auvergne-Rhône-Alpes","Isère","Grenoble Pt de Claix",null,"Bâtiment",null,null,"Coffreur Bancheur"]
["France","Auvergne-Rhône-Alpes","Isère","Grenoble Pt de Claix",null,"Réseaux - Télécommunications - Informatique - Numérique",null,null,"Technicien supérieur systèmes et réseaux"]
["France","Auvergne-Rhône-Alpes","Isère","Grenoble Pt de Claix",null,"Services aux entreprises et à la personne",null,null,"Agent de service médico-social"]
["France","Auvergne-Rhône-Alpes","Isère","Grenoble Pt de Claix",null,"Services aux entreprises et à la personne",null,null,"Responsable-coordonnateur services au domicile"]
["France","Auvergne-Rhône-Alpes","Rhône","Lyon St Priest",null,"Commerce - vente - distribution",null,null,"Manager d’unité marchande"]
["France","Auvergne-Rhône-Alpes","Rhône","Lyon St Priest",null,"Transports - logistique",null,null,"Technicien supérieur / Technicienne supérieure en méthodes et exploitation logistique"]
["France","Auvergne-Rhône-Alpes","Rhône","Lyon St Priest",null,"Bâtiment",null,null,"Technicien d'intervention en froid commercial et climatisation"]
["France","Auvergne-Rhône-Alpes","Rhône","Lyon St Priest",null,"Bâtiment",null,null,"Installateur en thermique et sanitaire"]
["France","Auvergne-Rhône-Alpes","Rhône","Lyon St Priest",null,"Hôtellerie - restauration - tourisme - loisirs",null,null,"Agent(e) de restauration"]
["France","Auvergne-Rhône-Alpes","Rhône","Lyon St Priest",null,"Bâtiment",null,null,"Maçon"]
["France","Auvergne-Rhône-Alpes","Rhône","Lyon St Priest",null,"Bâtiment",null,null,"Technicien supérieur du bâtiment option économie de la construction"]
["France","Auvergne-Rhône-Alpes","Rhône","Lyon St Priest",null,"Transports - logistique",null,null,"Conducteur livreur sur véhicule utilitaire léger"]
["France","Auvergne-Rhône-Alpes","Rhône","Lyon St Priest",null,"Commerce - vente - distribution",null,null,"Employé technicien-vendeur en matériel de sport"]
["France","Auvergne-Rhône-Alpes","Rhône","Lyon St Priest",null,"Hôtellerie - restauration - tourisme - loisirs",null,null,"Cuisinier"]
["France","Auvergne-Rhône-Alpes","Rhône","Lyon St Priest",null,"Bâtiment",null,null,"Agent de maintenance des bâtiments"]
["France","Auvergne-Rhône-Alpes","Rhône","Lyon St Priest",null,"Services aux entreprises et à la personne",null,null,"Assistant de vie aux familles"]
["France","Auvergne-Rhône-Alpes","Rhône","Lyon St Priest",null,"Bâtiment",null,null,"Electricien d'équipement du bâtiment"]
["France","Auvergne-Rhône-Alpes","Rhône","Lyon St Priest",null,"Bâtiment",null,null,"Technicien du bâtiment communicant et connecté"]
["France","Auvergne-Rhône-Alpes","Rhône","Lyon St Priest",null,"Commerce - vente - distribution",null,null,"Vendeur-conseil en magasin"]
["France","Auvergne-Rhône-Alpes","Rhône","Lyon St Priest",null,"Bâtiment",null,null,"Technicien d'études du bâtiment en dessin de projet"]
["France","Auvergne-Rhône-Alpes","Rhône","Lyon St Priest",null,"Bâtiment",null,null,"Coffreur Bancheur"]
["France","Auvergne-Rhône-Alpes","Rhône","Lyon St Priest",null,"Bâtiment",null,null,"BIM modeleur du bâtiment"]
["France","Auvergne-Rhône-Alpes","Rhône","Lyon St Priest",null,"Bâtiment",null,null,"Technicien métreur du bâtiment"]
["France","Auvergne-Rhône-Alpes","Rhône","Lyon St Priest",null,"Services aux entreprises et à la personne",null,null,"Agent de service médico-social"]
["France","Auvergne-Rhône-Alpes","Rhône","Lyon St Priest",null,"Services aux entreprises et à la personne",null,null,"Responsable-coordonnateur services au domicile"]
["France","Auvergne-Rhône-Alpes","Rhône","Lyon Vénissieux",null,"Fonctions supports de l'entreprise",null,null,"Secrétaire assistant médico-social"]
["France","Auvergne-Rhône-Alpes","Rhône","Lyon Vénissieux",null,"Industrie",null,null,"Technicien supérieur de maintenance industrielle"]
["France","Auvergne-Rhône-Alpes","Rhône","Lyon Vénissieux",null,"Industrie",null,null,"Technicien(ne) supérieur(e) en automatique et informatique industrielle"]
["France","Auvergne-Rhône-Alpes","Rhône","Lyon Vénissieux",null,"Fonctions supports de l'entreprise",null,null,"Formateur professionnel d'adultes"]
["France","Auvergne-Rhône-Alpes","Rhône","Lyon Vénissieux",null,"Industrie",null,null,"Agent de fabrication industrielle"]
["France","Auvergne-Rhône-Alpes","Rhône","Lyon Vénissieux",null,"Fonctions supports de l'entreprise",null,null,"Secrétaire assistant"]
["France","Auvergne-Rhône-Alpes","Rhône","Lyon Vénissieux",null,"Fonctions supports de l'entreprise",null,null,"Comptable assistant"]
["France","Auvergne-Rhône-Alpes","Rhône","Lyon Vénissieux",null,"Insertion et de la médiation",null,null,"Conseiller en insertion professionnelle"]
["France","Auvergne-Rhône-Alpes","Rhône","Lyon Vénissieux",null,"Industrie",null,null,"Technicien de maintenance industrielle"]
["France","Auvergne-Rhône-Alpes","Rhône","Lyon Vénissieux",null,"Insertion et de la médiation",null,null,"Encadrant technique d'insertion"]
["France","Auvergne-Rhône-Alpes","Rhône","Lyon Vénissieux",null,"Réseaux - Télécommunications - Informatique - Numérique",null,null,"Technicien d'assistance en informatique"]
["France","Auvergne-Rhône-Alpes","Rhône","Lyon Vénissieux",null,"Fonctions supports de l'entreprise",null,null,"Gestionnaire de paie"]
["France","Auvergne-Rhône-Alpes","Rhône","Lyon Vénissieux",null,"Fonctions supports de l'entreprise",null,null,"Assistant ressources humaines"]
["France","Auvergne-Rhône-Alpes","Rhône","Lyon Vénissieux",null,"Fonctions supports de l'entreprise",null,null,"Employé administratif et d’accueil"]
["France","Auvergne-Rhône-Alpes","Rhône","Lyon Vénissieux",null,"Réseaux - Télécommunications - Informatique - Numérique",null,null,"Technicien supérieur systèmes et réseaux"]
["France","Auvergne-Rhône-Alpes","Allier","Montluçon",null,"Fonctions supports de l'entreprise",null,null,"Secrétaire assistant médico-social"]
["France","Auvergne-Rhône-Alpes","Allier","Montluçon",null,"Bâtiment",null,null,"Installateur en thermique et sanitaire"]
["France","Auvergne-Rhône-Alpes","Allier","Montluçon",null,"Bâtiment",null,null,"Maçon"]
["France","Auvergne-Rhône-Alpes","Allier","Montluçon",null,"Fonctions supports de l'entreprise",null,null,"Formateur professionnel d'adultes"]
["France","Auvergne-Rhône-Alpes","Allier","Montluçon",null,"Bâtiment",null,null,"Agent de maintenance des bâtiments"]
["France","Auvergne-Rhône-Alpes","Allier","Montluçon",null,"Fonctions supports de l'entreprise",null,null,"Secrétaire assistant"]
["France","Auvergne-Rhône-Alpes","Allier","Montluçon",null,"Fonctions supports de l'entreprise",null,null,"Comptable assistant"]
["France","Auvergne-Rhône-Alpes","Allier","Montluçon",null,"Services aux entreprises et à la personne",null,null,"Assistant de vie aux familles"]
["France","Auvergne-Rhône-Alpes","Allier","Montluçon",null,"Services aux entreprises et à la personne",null,null,"Agent de propreté et d'hygiène"]
["France","Auvergne-Rhône-Alpes","Allier","Montluçon",null,"Fonctions supports de l'entreprise",null,null,"Secrétaire comptable"]
["France","Auvergne-Rhône-Alpes","Allier","Montluçon",null,"Industrie",null,null,"Agent de montage et de câblage en électronique"]
["France","Auvergne-Rhône-Alpes","Allier","Montluçon",null,"Industrie",null,null,"Technicien de maintenance industrielle"]
["France","Auvergne-Rhône-Alpes","Allier","Montluçon",null,"Industrie",null,null,"Contrôleur technique de véhicule léger"]
["France","Auvergne-Rhône-Alpes","Allier","Montluçon",null,"Industrie",null,null,"Soudeur assembleur industriel"]
["France","Auvergne-Rhône-Alpes","Allier","Montluçon",null,"Services aux entreprises et à la personne",null,null,"Agent de service médico-social"]
["France","Auvergne-Rhône-Alpes","Allier","Montluçon",null,"Bâtiment",null,null,"Carreleur-chapiste"]
["France","Auvergne-Rhône-Alpes","Haute-Loire","Puy en Velay",null,"Fonctions supports de l'entreprise",null,null,"Secrétaire assistant médico-social"]
["France","Auvergne-Rhône-Alpes","Haute-Loire","Puy en Velay",null,"Bâtiment",null,null,"Installateur en thermique et sanitaire"]
["France","Auvergne-Rhône-Alpes","Haute-Loire","Puy en Velay",null,"Bâtiment",null,null,"Menuisier agenceur"]
["France","Auvergne-Rhône-Alpes","Haute-Loire","Puy en Velay",null,"Bâtiment",null,null,"Plaquiste-plâtrier"]
["France","Auvergne-Rhône-Alpes","Haute-Loire","Puy en Velay",null,"Bâtiment",null,null,"Agent de maintenance des bâtiments"]
["France","Auvergne-Rhône-Alpes","Haute-Loire","Puy en Velay",null,"Bâtiment",null,null,"Menuisier poseur-installateur"]
["France","Auvergne-Rhône-Alpes","Haute-Loire","Puy en Velay",null,"Services aux entreprises et à la personne",null,null,"Agent de service médico-social"]
["France","Auvergne-Rhône-Alpes","Drôme","Romans",null,"Commerce - vente - distribution",null,null,"Cordonnier multiservices"]
["France","Auvergne-Rhône-Alpes","Drôme","Romans",null,"Artisanat d'art",null,null,"Sellier garnisseur"]
["France","Auvergne-Rhône-Alpes","Drôme","Romans",null,"Services aux entreprises et à la personne",null,null,"Assistant de vie aux familles"]
["France","Auvergne-Rhône-Alpes","Drôme","Romans",null,"Artisanat d'art",null,null,"Piqueur en maroquinerie"]
["France","Auvergne-Rhône-Alpes","Loire","Saint Etienne",null,"Fonctions supports de l'entreprise",null,null,"Secrétaire assistant médico-social"]
["France","Auvergne-Rhône-Alpes","Loire","Saint Etienne",null,"Bâtiment",null,null,"Solier moquettiste"]
["France","Auvergne-Rhône-Alpes","Loire","Saint Etienne",null,"Bâtiment",null,null,"Maçon en voirie et réseaux divers"]
["France","Auvergne-Rhône-Alpes","Loire","Saint Etienne",null,"Travaux publics",null,null,"Maçon en voirie et réseaux divers"]
["France","Auvergne-Rhône-Alpes","Loire","Saint Etienne",null,"Bâtiment",null,null,"Installateur en thermique et sanitaire"]
["France","Auvergne-Rhône-Alpes","Loire","Saint Etienne",null,"Industrie",null,null,"Technicien en usinage assisté par ordinateur"]
["France","Auvergne-Rhône-Alpes","Loire","Saint Etienne",null,"Bâtiment",null,null,"Maçon"]
["France","Auvergne-Rhône-Alpes","Loire","Saint Etienne",null,"Transports - logistique",null,null,"Conducteur livreur sur véhicule utilitaire léger"]
["France","Auvergne-Rhône-Alpes","Loire","Saint Etienne",null,"Travaux publics",null,null,"Monteur de réseaux électriques aéro-souterrains"]
["France","Auvergne-Rhône-Alpes","Loire","Saint Etienne",null,"Fonctions supports de l'entreprise",null,null,"Formateur professionnel d'adultes"]
["France","Auvergne-Rhône-Alpes","Loire","Saint Etienne",null,"Bâtiment",null,null,"Agent de maintenance des bâtiments"]
["France","Auvergne-Rhône-Alpes","Loire","Saint Etienne",null,"Services aux entreprises et à la personne",null,null,"Agent de propreté et d'hygiène"]
["France","Auvergne-Rhône-Alpes","Loire","Saint Etienne",null,"Insertion et de la médiation",null,null,"Conseiller en insertion professionnelle"]
["France","Auvergne-Rhône-Alpes","Loire","Saint Etienne",null,"Industrie",null,null,"Technicien de maintenance industrielle"]
["France","Auvergne-Rhône-Alpes","Loire","Saint Etienne",null,"Travaux publics",null,null,"Canalisateur"]
["France","Auvergne-Rhône-Alpes","Loire","Saint Etienne",null,"Bâtiment",null,null,"Electricien d'équipement du bâtiment"]
["France","Auvergne-Rhône-Alpes","Loire","Saint Etienne",null,"Transports - logistique",null,null,"Préparateur de commandes en entrepôt"]
["France","Auvergne-Rhône-Alpes","Loire","Saint Etienne",null,"Transports - logistique",null,null,"Cariste d'entrepôt"]
["France","Auvergne-Rhône-Alpes","Loire","Saint Etienne",null,"Transports - logistique",null,null,"Agent magasinier"]
["France","Auvergne-Rhône-Alpes","Loire","Saint Etienne",null,"Industrie",null,null,"Opérateur régleur en usinage assisté par ordinateur"]
["France","Auvergne-Rhône-Alpes","Loire","Saint Etienne",null,"Industrie",null,null,"Agent technique de réception et de valorisation de déchets"]
["France","Auvergne-Rhône-Alpes","Loire","Saint Etienne",null,"Services aux entreprises et à la personne",null,null,"Agent de service médico-social"]
["France","Auvergne-Rhône-Alpes","Drôme","Valence",null,"Fonctions supports de l'entreprise",null,null,"Secrétaire assistant médico-social"]
["France","Auvergne-Rhône-Alpes","Drôme","Valence",null,"Bâtiment",null,null,"Peintre en bâtiment"]
["France","Auvergne-Rhône-Alpes","Drôme","Valence",null,"Fonctions supports de l'entreprise",null,null,"Gestionnaire comptable et fiscal"]
["France","Auvergne-Rhône-Alpes","Drôme","Valence",null,"Hôtellerie - restauration - tourisme - loisirs",null,null,"Agent(e) de restauration"]
["France","Auvergne-Rhône-Alpes","Drôme","Valence",null,"Industrie",null,null,"Conducteur d'installation et de machines automatisées"]
["France","Auvergne-Rhône-Alpes","Drôme","Valence",null,"Bâtiment",null,null,"Maçon"]
["France","Auvergne-Rhône-Alpes","Drôme","Valence",null,"Bâtiment",null,null,"Plaquiste-plâtrier"]
["France","Auvergne-Rhône-Alpes","Drôme","Valence",null,"Fonctions supports de l'entreprise",null,null,"Formateur professionnel d'adultes"]
["France","Auvergne-Rhône-Alpes","Drôme","Valence",null,"Industrie",null,null,"Agent de fabrication industrielle"]
["France","Auvergne-Rhône-Alpes","Drôme","Valence",null,"Fonctions supports de l'entreprise",null,null,"Secrétaire assistant"]
["France","Auvergne-Rhône-Alpes","Drôme","Valence",null,"Fonctions supports de l'entreprise",null,null,"Comptable assistant"]
["France","Auvergne-Rhône-Alpes","Drôme","Valence",null,"Services aux entreprises et à la personne",null,null,"Assistant de vie aux familles"]
["France","Auvergne-Rhône-Alpes","Drôme","Valence",null,"Fonctions supports de l'entreprise",null,null,"Secrétaire comptable"]
["France","Auvergne-Rhône-Alpes","Drôme","Valence",null,"Industrie",null,null,"Technicien de maintenance industrielle"]
["France","Auvergne-Rhône-Alpes","Drôme","Valence",null,"Bâtiment",null,null,"Electricien d'équipement du bâtiment"]
["France","Auvergne-Rhône-Alpes","Drôme","Valence",null,"Fonctions supports de l'entreprise",null,null,"Gestionnaire de paie"]
["France","Auvergne-Rhône-Alpes","Drôme","Valence",null,"Bâtiment",null,null,"Métallier"]
["France","Auvergne-Rhône-Alpes","Drôme","Valence",null,"Industrie",null,null,"Soudeur TIG électrode enrobée"]
["France","Auvergne-Rhône-Alpes","Drôme","Valence",null,"Industrie",null,null,"Technicien en chaudronnerie"]
["France","Auvergne-Rhône-Alpes","Drôme","Valence",null,"Fonctions supports de l'entreprise",null,null,"Employé administratif et d’accueil"]
["France","Auvergne-Rhône-Alpes","Drôme","Valence",null,"Industrie",null,null,"Soudeur assembleur industriel"]
["France","Bourgogne-Franche-Comté","Territoire-de-Belfort","Belfort",null,"Fonctions supports de l'entreprise",null,null,"Secrétaire assistant médico-social"]
["France","Bourgogne-Franche-Comté","Territoire-de-Belfort","Belfort",null,"Bâtiment",null,null,"Peintre en bâtiment"]
["France","Bourgogne-Franche-Comté","Territoire-de-Belfort","Belfort",null,"Travaux publics",null,null,"Maçon en voirie et réseaux divers"]
["France","Bourgogne-Franche-Comté","Territoire-de-Belfort","Belfort",null,"Bâtiment",null,null,"Installateur en thermique et sanitaire"]
["France","Bourgogne-Franche-Comté","Territoire-de-Belfort","Belfort",null,"Industrie",null,null,"Monteur qualifié d'équipements industriels"]
["France","Bourgogne-Franche-Comté","Territoire-de-Belfort","Belfort",null,"Industrie",null,null,"Technicien en usinage assisté par ordinateur"]
["France","Bourgogne-Franche-Comté","Territoire-de-Belfort","Belfort",null,"Bâtiment",null,null,"Maçon"]
["France","Bourgogne-Franche-Comté","Territoire-de-Belfort","Belfort",null,"Industrie",null,null,"Technicien supérieur de maintenance industrielle"]
["France","Bourgogne-Franche-Comté","Territoire-de-Belfort","Belfort",null,"Bâtiment",null,null,"Plaquiste-plâtrier"]
["France","Bourgogne-Franche-Comté","Territoire-de-Belfort","Belfort",null,"Industrie",null,null,"Agent de fabrication industrielle"]
["France","Bourgogne-Franche-Comté","Territoire-de-Belfort","Belfort",null,"Fonctions supports de l'entreprise",null,null,"Secrétaire assistant"]
["France","Bourgogne-Franche-Comté","Territoire-de-Belfort","Belfort",null,"Bâtiment",null,null,"Façadier-peintre"]
["France","Bourgogne-Franche-Comté","Territoire-de-Belfort","Belfort",null,"Services aux entreprises et à la personne",null,null,"Assistant de vie aux familles"]
["France","Bourgogne-Franche-Comté","Territoire-de-Belfort","Belfort",null,"Services aux entreprises et à la personne",null,null,"Agent de propreté et d'hygiène"]
["France","Bourgogne-Franche-Comté","Territoire-de-Belfort","Belfort",null,"Fonctions supports de l'entreprise",null,null,"Secrétaire comptable"]
["France","Bourgogne-Franche-Comté","Territoire-de-Belfort","Belfort",null,"Industrie",null,null,"Technicien de maintenance industrielle"]
["France","Bourgogne-Franche-Comté","Territoire-de-Belfort","Belfort",null,"Industrie",null,null,"Opérateur régleur en usinage assisté par ordinateur"]
["France","Bourgogne-Franche-Comté","Territoire-de-Belfort","Belfort",null,"Industrie",null,null,"Tourneur en réalisation de pièces mécaniques"]
["France","Bourgogne-Franche-Comté","Territoire-de-Belfort","Belfort",null,"Industrie",null,null,"Fraiseur en réalisation de pièces mécaniques"]
["France","Bourgogne-Franche-Comté","Territoire-de-Belfort","Belfort",null,"Fonctions supports de l'entreprise",null,null,"Assistant ressources humaines"]
["France","Bourgogne-Franche-Comté","Territoire-de-Belfort","Belfort",null,"Industrie",null,null,"Technicien supérieur méthodes produit process"]
["France","Bourgogne-Franche-Comté","Territoire-de-Belfort","Belfort",null,"Fonctions supports de l'entreprise",null,null,"Employé administratif et d’accueil"]
["France","Bourgogne-Franche-Comté","Territoire-de-Belfort","Belfort",null,"Services aux entreprises et à la personne",null,null,"Agent de service médico-social"]
["France","Bourgogne-Franche-Comté","Doubs","Besançon",null,"Fonctions supports de l'entreprise",null,null,"Secrétaire assistant médico-social"]
["France","Bourgogne-Franche-Comté","Doubs","Besançon",null,"Travaux publics",null,null,"Maçon en voirie et réseaux divers"]
["France","Bourgogne-Franche-Comté","Doubs","Besançon",null,"Hôtellerie - restauration - tourisme - loisirs",null,null,"Agent(e) de restauration"]
["France","Bourgogne-Franche-Comté","Doubs","Besançon",null,"Bâtiment",null,null,"Maçon"]
["France","Bourgogne-Franche-Comté","Doubs","Besançon",null,"Artisanat d'art",null,null,"Agent technicien vendeur en horlogerie"]
["France","Bourgogne-Franche-Comté","Doubs","Besançon",null,"Transports - logistique",null,null,"Conducteur livreur sur véhicule utilitaire léger"]
["France","Bourgogne-Franche-Comté","Doubs","Besançon",null,"Commerce - vente - distribution",null,null,"Employé technicien-vendeur en matériel de sport"]
["France","Bourgogne-Franche-Comté","Doubs","Besançon",null,"Industrie",null,null,"Agent de fabrication industrielle"]
["France","Bourgogne-Franche-Comté","Doubs","Besançon",null,"Bâtiment",null,null,"Agent de maintenance des bâtiments"]
["France","Bourgogne-Franche-Comté","Doubs","Besançon",null,"Fonctions supports de l'entreprise",null,null,"Secrétaire assistant"]
["France","Bourgogne-Franche-Comté","Doubs","Besançon",null,"Fonctions supports de l'entreprise",null,null,"Comptable assistant"]
["France","Bourgogne-Franche-Comté","Doubs","Besançon",null,"Fonctions supports de l'entreprise",null,null,"Secrétaire comptable"]
["France","Bourgogne-Franche-Comté","Doubs","Besançon",null,"Insertion et de la médiation",null,null,"Conseiller en insertion professionnelle"]
["France","Bourgogne-Franche-Comté","Doubs","Besançon",null,"Artisanat d'art",null,null,"Horloger"]
["France","Bourgogne-Franche-Comté","Doubs","Besançon",null,"Fonctions supports de l'entreprise",null,null,"Assistant ressources humaines"]
["France","Bourgogne-Franche-Comté","Doubs","Besançon",null,"Fonctions supports de l'entreprise",null,null,"Employé administratif et d’accueil"]
["France","Bourgogne-Franche-Comté","Côte-d'Or","Dijon Chevigny",null,"Fonctions supports de l'entreprise",null,null,"Secrétaire assistant médico-social"]
["France","Bourgogne-Franche-Comté","Côte-d'Or","Dijon Chevigny",null,"Bâtiment",null,null,"Solier moquettiste"]
["France","Bourgogne-Franche-Comté","Côte-d'Or","Dijon Chevigny",null,"Bâtiment",null,null,"Peintre en bâtiment"]
["France","Bourgogne-Franche-Comté","Côte-d'Or","Dijon Chevigny",null,"Bâtiment",null,null,"Installateur en thermique et sanitaire"]
["France","Bourgogne-Franche-Comté","Côte-d'Or","Dijon Chevigny",null,"Hôtellerie - restauration - tourisme - loisirs",null,null,"Agent(e) de restauration"]
["France","Bourgogne-Franche-Comté","Côte-d'Or","Dijon Chevigny",null,"Commerce - vente - distribution",null,null,"Employé commercial en magasin"]
["France","Bourgogne-Franche-Comté","Côte-d'Or","Dijon Chevigny",null,"Bâtiment",null,null,"Maçon"]
["France","Bourgogne-Franche-Comté","Côte-d'Or","Dijon Chevigny",null,"Bâtiment",null,null,"Menuisier agenceur"]
["France","Bourgogne-Franche-Comté","Côte-d'Or","Dijon Chevigny",null,"Transports - logistique",null,null,"Conducteur livreur sur véhicule utilitaire léger"]
["France","Bourgogne-Franche-Comté","Côte-d'Or","Dijon Chevigny",null,"Commerce - vente - distribution",null,null,"Employé technicien-vendeur en matériel de sport"]
["France","Bourgogne-Franche-Comté","Côte-d'Or","Dijon Chevigny",null,"Bâtiment",null,null,"Plaquiste-plâtrier"]
["France","Bourgogne-Franche-Comté","Côte-d'Or","Dijon Chevigny",null,"Fonctions supports de l'entreprise",null,null,"Formateur professionnel d'adultes"]
["France","Bourgogne-Franche-Comté","Côte-d'Or","Dijon Chevigny",null,"Hôtellerie - restauration - tourisme - loisirs",null,null,"Cuisinier"]
["France","Bourgogne-Franche-Comté","Côte-d'Or","Dijon Chevigny",null,"Bâtiment",null,null,"Agent de maintenance des bâtiments"]
["France","Bourgogne-Franche-Comté","Côte-d'Or","Dijon Chevigny",null,"Fonctions supports de l'entreprise",null,null,"Secrétaire assistant"]
["France","Bourgogne-Franche-Comté","Côte-d'Or","Dijon Chevigny",null,"Bâtiment",null,null,"Façadier-peintre"]
["France","Bourgogne-Franche-Comté","Côte-d'Or","Dijon Chevigny",null,"Fonctions supports de l'entreprise",null,null,"Comptable assistant"]
["France","Bourgogne-Franche-Comté","Côte-d'Or","Dijon Chevigny",null,"Fonctions supports de l'entreprise",null,null,"Secrétaire comptable"]
["France","Bourgogne-Franche-Comté","Côte-d'Or","Dijon Chevigny",null,"Réseaux - Télécommunications - Informatique - Numérique",null,null,"Installateur de réseaux de télécommunications"]
["France","Bourgogne-Franche-Comté","Côte-d'Or","Dijon Chevigny",null,"Services aux entreprises et à la personne",null,null,"Ouvrier du paysage"]
["France","Bourgogne-Franche-Comté","Côte-d'Or","Dijon Chevigny",null,"Bâtiment",null,null,"Electricien d'équipement du bâtiment"]
["France","Bourgogne-Franche-Comté","Côte-d'Or","Dijon Chevigny",null,"Transports - logistique",null,null,"Préparateur de commandes en entrepôt"]
["France","Bourgogne-Franche-Comté","Côte-d'Or","Dijon Chevigny",null,"Réseaux - Télécommunications - Informatique - Numérique",null,null,"Technicien de réseaux de télécommunications"]
["France","Bourgogne-Franche-Comté","Côte-d'Or","Dijon Chevigny",null,"Bâtiment",null,null,"Technicien du bâtiment communicant et connecté"]
["France","Bourgogne-Franche-Comté","Côte-d'Or","Dijon Chevigny",null,"Bâtiment",null,null,"Technicien de maintenance d'équipements de confort climatique"]
["France","Bourgogne-Franche-Comté","Côte-d'Or","Dijon Chevigny",null,"Fonctions supports de l'entreprise",null,null,"Gestionnaire de paie"]
["France","Bourgogne-Franche-Comté","Côte-d'Or","Dijon Chevigny",null,"Bâtiment",null,null,"Maçon du bâti ancien"]
["France","Bourgogne-Franche-Comté","Côte-d'Or","Dijon Chevigny",null,"Fonctions supports de l'entreprise",null,null,"Assistant ressources humaines"]
["France","Bourgogne-Franche-Comté","Côte-d'Or","Dijon Chevigny",null,"Commerce - vente - distribution",null,null,"Assistant commercial"]
["France","Bourgogne-Franche-Comté","Côte-d'Or","Dijon Chevigny",null,"Fonctions supports de l'entreprise",null,null,"Assistant de direction"]
["France","Bourgogne-Franche-Comté","Côte-d'Or","Dijon Chevigny",null,"Fonctions supports de l'entreprise",null,null,"Employé administratif et d’accueil"]
["France","Bourgogne-Franche-Comté","Côte-d'Or","Dijon Chevigny",null,"Bâtiment",null,null,"Technicien d'installation en équipements de confort climatique"]
["France","Bourgogne-Franche-Comté","Côte-d'Or","Dijon Chevigny",null,"Bâtiment",null,null,"Carreleur-chapiste"]
["France","Bourgogne-Franche-Comté","Jura","Lons le Saunier",null,"Commerce - vente - distribution",null,null,"Employé commercial en magasin"]
["France","Bourgogne-Franche-Comté","Jura","Lons le Saunier",null,"Fonctions supports de l'entreprise",null,null,"Comptable assistant"]
["France","Bourgogne-Franche-Comté","Jura","Lons le Saunier",null,"Services aux entreprises et à la personne",null,null,"Assistant de vie aux familles"]
["France","Bourgogne-Franche-Comté","Jura","Lons le Saunier",null,"Industrie",null,null,"Agent technique de réception et de valorisation de déchets"]
["France","Bourgogne-Franche-Comté","Jura","Lons le Saunier",null,"Fonctions supports de l'entreprise",null,null,"Assistant de direction"]
["France","Bourgogne-Franche-Comté","Jura","Lons le Saunier",null,"Bâtiment",null,null,"Charpentier bois"]
["France","Bourgogne-Franche-Comté","Jura","Lons le Saunier",null,"Bâtiment",null,null,"Constructeur bois"]
["France","Bourgogne-Franche-Comté","Jura","Lons le Saunier",null,"Bâtiment",null,null,"Menuisier poseur-installateur"]
["France","Bourgogne-Franche-Comté","Jura","Lons le Saunier",null,"Services aux entreprises et à la personne",null,null,"Agent de service médico-social"]
["France","Bourgogne-Franche-Comté","Yonne","Migennes",null,"Industrie",null,null,"Mécanicien(ne) automobile"]
["France","Bourgogne-Franche-Comté","Yonne","Migennes",null,"Bâtiment",null,null,"Peintre en bâtiment"]
["France","Bourgogne-Franche-Comté","Yonne","Migennes",null,"Bâtiment",null,null,"Maçon"]
["France","Bourgogne-Franche-Comté","Yonne","Migennes",null,"Industrie",null,null,"Mécanicien(ne) de maintenance automobile"]
["France","Bourgogne-Franche-Comté","Yonne","Migennes",null,"Transports - logistique",null,null,"Conducteur livreur sur véhicule utilitaire léger"]
["France","Bourgogne-Franche-Comté","Yonne","Migennes",null,"Bâtiment",null,null,"Plaquiste-plâtrier"]
["France","Bourgogne-Franche-Comté","Yonne","Migennes",null,"Commerce - vente - distribution",null,null,"Négociateur technico-commercial"]
["France","Bourgogne-Franche-Comté","Yonne","Migennes",null,"Bâtiment",null,null,"Façadier-peintre"]
["France","Bourgogne-Franche-Comté","Yonne","Migennes",null,"Services aux entreprises et à la personne",null,null,"Assistant de vie aux familles"]
["France","Bourgogne-Franche-Comté","Yonne","Migennes",null,"Services aux entreprises et à la personne",null,null,"Agent de propreté et d'hygiène"]
["France","Bourgogne-Franche-Comté","Yonne","Migennes",null,"Insertion et de la médiation",null,null,"Conseiller en insertion professionnelle"]
["France","Bourgogne-Franche-Comté","Yonne","Migennes",null,"Industrie",null,null,"Technicien(ne) électromécanicien(ne) automobile"]
["France","Bourgogne-Franche-Comté","Yonne","Migennes",null,"Commerce - vente - distribution",null,null,"Vendeur-conseil en magasin"]
["France","Bourgogne-Franche-Comté","Yonne","Migennes",null,"Industrie",null,null,"Soudeur TIG électrode enrobée"]
["France","Bourgogne-Franche-Comté","Yonne","Migennes",null,"Fonctions supports de l'entreprise",null,null,"Employé administratif et d’accueil"]
["France","Bourgogne-Franche-Comté","Yonne","Migennes",null,"Bâtiment",null,null,"Menuisier poseur-installateur"]
["France","Bourgogne-Franche-Comté","Yonne","Migennes",null,"Services aux entreprises et à la personne",null,null,"Agent de sûreté et de sécurité privée"]
["France","Bourgogne-Franche-Comté","Yonne","Migennes",null,"Industrie",null,null,"Soudeur assembleur industriel"]
["France","Bourgogne-Franche-Comté","Yonne","Migennes",null,"Bâtiment",null,null,"Carreleur-chapiste"]
["France","Bourgogne-Franche-Comté","Saône-et-Loire","Montceau les Mines",null,"Fonctions supports de l'entreprise",null,null,"Secrétaire assistant médico-social"]
["France","Bourgogne-Franche-Comté","Saône-et-Loire","Montceau les Mines",null,"Bâtiment",null,null,"Peintre en bâtiment"]
["France","Bourgogne-Franche-Comté","Saône-et-Loire","Montceau les Mines",null,"Travaux publics",null,null,"Maçon en voirie et réseaux divers"]
["France","Bourgogne-Franche-Comté","Saône-et-Loire","Montceau les Mines",null,"Bâtiment",null,null,"Couvreur-zingueur"]
["France","Bourgogne-Franche-Comté","Saône-et-Loire","Montceau les Mines",null,"Industrie",null,null,"Tuyauteur industriel"]
["France","Bourgogne-Franche-Comté","Saône-et-Loire","Montceau les Mines",null,"Hôtellerie - restauration - tourisme - loisirs",null,null,"Agent(e) de restauration"]
["France","Bourgogne-Franche-Comté","Saône-et-Loire","Montceau les Mines",null,"Bâtiment",null,null,"Maçon"]
["France","Bourgogne-Franche-Comté","Saône-et-Loire","Montceau les Mines",null,"Réseaux - Télécommunications - Informatique - Numérique",null,null,"Installateur dépanneur en informatique"]
["France","Bourgogne-Franche-Comté","Saône-et-Loire","Montceau les Mines",null,"Bâtiment",null,null,"Plaquiste-plâtrier"]
["France","Bourgogne-Franche-Comté","Saône-et-Loire","Montceau les Mines",null,"Hôtellerie - restauration - tourisme - loisirs",null,null,"Cuisinier"]
["France","Bourgogne-Franche-Comté","Saône-et-Loire","Montceau les Mines",null,"Fonctions supports de l'entreprise",null,null,"Secrétaire assistant"]
["France","Bourgogne-Franche-Comté","Saône-et-Loire","Montceau les Mines",null,"Bâtiment",null,null,"Façadier-peintre"]
["France","Bourgogne-Franche-Comté","Saône-et-Loire","Montceau les Mines",null,"Fonctions supports de l'entreprise",null,null,"Comptable assistant"]
["France","Bourgogne-Franche-Comté","Saône-et-Loire","Montceau les Mines",null,"Fonctions supports de l'entreprise",null,null,"Secrétaire comptable"]
["France","Bourgogne-Franche-Comté","Saône-et-Loire","Montceau les Mines",null,"Industrie",null,null,"Technicien de maintenance industrielle"]
["France","Bourgogne-Franche-Comté","Saône-et-Loire","Montceau les Mines",null,"Bâtiment",null,null,"Electricien d'équipement du bâtiment"]
["France","Bourgogne-Franche-Comté","Saône-et-Loire","Montceau les Mines",null,"Réseaux - Télécommunications - Informatique - Numérique",null,null,"Technicien d'assistance en informatique"]
["France","Bourgogne-Franche-Comté","Saône-et-Loire","Montceau les Mines",null,"Fonctions supports de l'entreprise",null,null,"Gestionnaire de paie"]
["France","Bourgogne-Franche-Comté","Saône-et-Loire","Montceau les Mines",null,"Fonctions supports de l'entreprise",null,null,"Assistant ressources humaines"]
["France","Bourgogne-Franche-Comté","Saône-et-Loire","Montceau les Mines",null,"Réseaux - Télécommunications - Informatique - Numérique",null,null,"Technicien supérieur systèmes et réseaux"]
["France","Bourgogne-Franche-Comté","Saône-et-Loire","Montceau les Mines",null,"Services aux entreprises et à la personne",null,null,"Agent de sûreté et de sécurité privée"]
["France","Bourgogne-Franche-Comté","Saône-et-Loire","Montceau les Mines",null,"Industrie",null,null,"Soudeur assembleur industriel"]
["France","Bourgogne-Franche-Comté","Nièvre","Nevers",null,"Bâtiment",null,null,"Peintre en bâtiment"]
["France","Bourgogne-Franche-Comté","Nièvre","Nevers",null,"Bâtiment",null,null,"Plaquiste-plâtrier"]
["France","Bourgogne-Franche-Comté","Nièvre","Nevers",null,"Fonctions supports de l'entreprise",null,null,"Secrétaire assistant"]
["France","Bourgogne-Franche-Comté","Nièvre","Nevers",null,"Bâtiment",null,null,"Façadier-peintre"]
["France","Bourgogne-Franche-Comté","Nièvre","Nevers",null,"Services aux entreprises et à la personne",null,null,"Assistant de vie aux familles"]
["France","Bourgogne-Franche-Comté","Nièvre","Nevers",null,"Insertion et de la médiation",null,null,"Conseiller en insertion professionnelle"]
["France","Bourgogne-Franche-Comté","Nièvre","Nevers",null,"Bâtiment",null,null,"Menuisier de fabrication bois et dérivés"]
["France","Bourgogne-Franche-Comté","Nièvre","Nevers",null,"Bâtiment",null,null,"Electricien d'équipement du bâtiment"]
["France","Bourgogne-Franche-Comté","Nièvre","Nevers",null,"Fonctions supports de l'entreprise",null,null,"Gestionnaire de paie"]
["France","Bourgogne-Franche-Comté","Nièvre","Nevers",null,"Fonctions supports de l'entreprise",null,null,"Assistant ressources humaines"]
["France","Bourgogne-Franche-Comté","Nièvre","Nevers",null,"Bâtiment",null,null,"Charpentier bois"]
["France","Bourgogne-Franche-Comté","Nièvre","Nevers",null,"Bâtiment",null,null,"Constructeur bois"]
["France","Bourgogne-Franche-Comté","Haute-Saône","Vesoul Navenne",null,"Industrie",null,null,"Mécanicien(ne) automobile"]
["France","Bourgogne-Franche-Comté","Haute-Saône","Vesoul Navenne",null,"Bâtiment",null,null,"Peintre en bâtiment"]
["France","Bourgogne-Franche-Comté","Haute-Saône","Vesoul Navenne",null,"Commerce - vente - distribution",null,null,"Employé commercial en magasin"]
["France","Bourgogne-Franche-Comté","Haute-Saône","Vesoul Navenne",null,"Industrie",null,null,"Mécanicien(ne) de maintenance automobile"]
["France","Bourgogne-Franche-Comté","Haute-Saône","Vesoul Navenne",null,"Bâtiment",null,null,"Plaquiste-plâtrier"]
["France","Bourgogne-Franche-Comté","Haute-Saône","Vesoul Navenne",null,"Bâtiment",null,null,"Agent de maintenance des bâtiments"]
["France","Bourgogne-Franche-Comté","Haute-Saône","Vesoul Navenne",null,"Fonctions supports de l'entreprise",null,null,"Secrétaire assistant"]
["France","Bourgogne-Franche-Comté","Haute-Saône","Vesoul Navenne",null,"Bâtiment",null,null,"Façadier-peintre"]
["France","Bourgogne-Franche-Comté","Haute-Saône","Vesoul Navenne",null,"Fonctions supports de l'entreprise",null,null,"Comptable assistant"]
["France","Bourgogne-Franche-Comté","Haute-Saône","Vesoul Navenne",null,"Services aux entreprises et à la personne",null,null,"Assistant de vie aux familles"]
["France","Bourgogne-Franche-Comté","Haute-Saône","Vesoul Navenne",null,"Fonctions supports de l'entreprise",null,null,"Secrétaire comptable"]
["France","Bourgogne-Franche-Comté","Haute-Saône","Vesoul Navenne",null,"Insertion et de la médiation",null,null,"Conseiller en insertion professionnelle"]
["France","Bourgogne-Franche-Comté","Haute-Saône","Vesoul Navenne",null,"Industrie",null,null,"Technicien(ne) électromécanicien(ne) automobile"]
["France","Bourgogne-Franche-Comté","Haute-Saône","Vesoul Navenne",null,"Bâtiment",null,null,"Menuisier de fabrication bois et dérivés"]
["France","Bourgogne-Franche-Comté","Haute-Saône","Vesoul Navenne",null,"Bâtiment",null,null,"Electricien d'équipement du bâtiment"]
["France","Bourgogne-Franche-Comté","Haute-Saône","Vesoul Navenne",null,"Transports - logistique",null,null,"Préparateur de commandes en entrepôt"]
["France","Bourgogne-Franche-Comté","Haute-Saône","Vesoul Navenne",null,"Bâtiment",null,null,"Technicien du bâtiment communicant et connecté"]
["France","Bourgogne-Franche-Comté","Haute-Saône","Vesoul Navenne",null,"Fonctions supports de l'entreprise",null,null,"Assistant ressources humaines"]
["France","Bourgogne-Franche-Comté","Haute-Saône","Vesoul Navenne",null,"Fonctions supports de l'entreprise",null,null,"Employé administratif et d’accueil"]
["France","Bourgogne-Franche-Comté","Haute-Saône","Vesoul Navenne",null,"Bâtiment",null,null,"Menuisier poseur-installateur"]
["France","Bourgogne-Franche-Comté","Haute-Saône","Vesoul Navenne",null,"Industrie",null,null,"Contrôleur technique de véhicule léger"]
["France","Bourgogne-Franche-Comté","Haute-Saône","Vesoul Navenne",null,"Services aux entreprises et à la personne",null,null,"Agent de service médico-social"]
["France","Bretagne","Morbihan","Auray Kervhal en Brech",null,"Industrie",null,null,"Agent de maintenance en marine de plaisance"]
["France","Bretagne","Morbihan","Auray Kervhal en Brech",null,"Bâtiment",null,null,"Couvreur-zingueur"]
["France","Bretagne","Morbihan","Auray Kervhal en Brech",null,"Bâtiment",null,null,"Installateur en thermique et sanitaire"]
["France","Bretagne","Morbihan","Auray Kervhal en Brech",null,"Industrie",null,null,"Mécanicien réparateur en marine de plaisance"]
["France","Bretagne","Morbihan","Auray Kervhal en Brech",null,"Hôtellerie - restauration - tourisme - loisirs",null,null,"Agent(e) de restauration"]
["France","Bretagne","Morbihan","Auray Kervhal en Brech",null,"Bâtiment",null,null,"Plaquiste-plâtrier"]
["France","Bretagne","Morbihan","Auray Kervhal en Brech",null,"Hôtellerie - restauration - tourisme - loisirs",null,null,"Cuisinier"]
["France","Bretagne","Morbihan","Auray Kervhal en Brech",null,"Industrie",null,null,"Constructeur aménageur nautique bois et composites"]
["France","Bretagne","Morbihan","Auray Kervhal en Brech",null,"Hôtellerie - restauration - tourisme - loisirs",null,null,"Réceptionniste en hôtellerie"]
["France","Bretagne","Morbihan","Auray Kervhal en Brech",null,"Industrie",null,null,"Opérateur composites hautes performances"]
["France","Bretagne","Morbihan","Auray Kervhal en Brech",null,"Hôtellerie - restauration - tourisme - loisirs",null,null,"Guide accompagnateur touristique"]
["France","Bretagne","Morbihan","Auray Kervhal en Brech",null,"Bâtiment",null,null,"Carreleur-chapiste"]
["France","Bretagne","Morbihan","Auray Kervhal en Brech",null,"Hôtellerie - restauration - tourisme - loisirs",null,null,"Responsable d'établissement touristique"]
["France","Bretagne","Finistère","Brest",null,"Fonctions supports de l'entreprise",null,null,"Secrétaire assistant médico-social"]
["France","Bretagne","Finistère","Brest",null,"Bâtiment",null,null,"Peintre en bâtiment"]
["France","Bretagne","Finistère","Brest",null,"Bâtiment",null,null,"Maçon en voirie et réseaux divers"]
["France","Bretagne","Finistère","Brest",null,"Travaux publics",null,null,"Maçon en voirie et réseaux divers"]
["France","Bretagne","Finistère","Brest",null,"Commerce - vente - distribution",null,null,"Manager d’unité marchande"]
["France","Bretagne","Finistère","Brest",null,"Fonctions supports de l'entreprise",null,null,"Gestionnaire comptable et fiscal"]
["France","Bretagne","Finistère","Brest",null,"Industrie",null,null,"Tuyauteur industriel"]
["France","Bretagne","Finistère","Brest",null,"Commerce - vente - distribution",null,null,"Employé commercial en magasin"]
["France","Bretagne","Finistère","Brest",null,"Bâtiment",null,null,"Maçon"]
["France","Bretagne","Finistère","Brest",null,"Industrie",null,null,"Mécanicien(ne) de maintenance automobile"]
["France","Bretagne","Finistère","Brest",null,"Commerce - vente - distribution",null,null,"Négociateur technico-commercial"]
["France","Bretagne","Finistère","Brest",null,"Fonctions supports de l'entreprise",null,null,"Formateur professionnel d'adultes"]
["France","Bretagne","Finistère","Brest",null,"Fonctions supports de l'entreprise",null,null,"Secrétaire assistant"]
["France","Bretagne","Finistère","Brest",null,"Bâtiment",null,null,"Façadier-peintre"]
["France","Bretagne","Finistère","Brest",null,"Fonctions supports de l'entreprise",null,null,"Comptable assistant"]
["France","Bretagne","Finistère","Brest",null,"Services aux entreprises et à la personne",null,null,"Assistant de vie aux familles"]
["France","Bretagne","Finistère","Brest",null,"Fonctions supports de l'entreprise",null,null,"Secrétaire comptable"]
["France","Bretagne","Finistère","Brest",null,"Insertion et de la médiation",null,null,"Conseiller en insertion professionnelle"]
["France","Bretagne","Finistère","Brest",null,"Commerce - vente - distribution",null,null,"Vendeur-conseil en magasin"]
["France","Bretagne","Finistère","Brest",null,"Fonctions supports de l'entreprise",null,null,"Gestionnaire de paie"]
["France","Bretagne","Finistère","Brest",null,"Bâtiment",null,null,"Maçon du bâti ancien"]
["France","Bretagne","Finistère","Brest",null,"Bâtiment",null,null,"Métallier"]
["France","Bretagne","Finistère","Brest",null,"Réseaux - Télécommunications - Informatique - Numérique",null,null,"Développeur web et web mobile"]
["France","Bretagne","Finistère","Brest",null,"Fonctions supports de l'entreprise",null,null,"Assistant ressources humaines"]
["France","Bretagne","Finistère","Brest",null,"Commerce - vente - distribution",null,null,"Assistant commercial"]
["France","Bretagne","Finistère","Brest",null,"Fonctions supports de l'entreprise",null,null,"Assistant de direction"]
["France","Bretagne","Finistère","Brest",null,"Fonctions supports de l'entreprise",null,null,"Employé administratif et d’accueil"]
["France","Bretagne","Finistère","Brest",null,"Industrie",null,null,"Soudeur assembleur industriel"]
["France","Bretagne","Morbihan","Lorient",null,"Bâtiment",null,null,"Tailleur de pierre"]
["France","Bretagne","Morbihan","Lorient",null,"Bâtiment",null,null,"Peintre en bâtiment"]
["France","Bretagne","Morbihan","Lorient",null,"Commerce - vente - distribution",null,null,"Assistant manager d’unité marchande"]
["France","Bretagne","Morbihan","Lorient",null,"Bâtiment",null,null,"Maçon en voirie et réseaux divers"]
["France","Bretagne","Morbihan","Lorient",null,"Travaux publics",null,null,"Maçon en voirie et réseaux divers"]
["France","Bretagne","Morbihan","Lorient",null,"Industrie",null,null,"Tuyauteur industriel"]
["France","Bretagne","Morbihan","Lorient",null,"Commerce - vente - distribution",null,null,"Employé commercial en magasin"]
["France","Bretagne","Morbihan","Lorient",null,"Bâtiment",null,null,"Maçon"]
["France","Bretagne","Morbihan","Lorient",null,"Industrie",null,null,"Technicien supérieur de maintenance industrielle"]
["France","Bretagne","Morbihan","Lorient",null,"Bâtiment",null,null,"Technicien supérieur du bâtiment option économie de la construction"]
["France","Bretagne","Morbihan","Lorient",null,"Commerce - vente - distribution",null,null,"Négociateur technico-commercial"]
["France","Bretagne","Morbihan","Lorient",null,"Bâtiment",null,null,"Agent de maintenance des bâtiments"]
["France","Bretagne","Morbihan","Lorient",null,"Bâtiment",null,null,"Façadier-peintre"]
["France","Bretagne","Morbihan","Lorient",null,"Industrie",null,null,"Technicien de maintenance industrielle"]
["France","Bretagne","Morbihan","Lorient",null,"Travaux publics",null,null,"Canalisateur"]
["France","Bretagne","Morbihan","Lorient",null,"Services aux entreprises et à la personne",null,null,"Ouvrier du paysage"]
["France","Bretagne","Morbihan","Lorient",null,"Réseaux - Télécommunications - Informatique - Numérique",null,null,"Technicien d'assistance en informatique"]
["France","Bretagne","Morbihan","Lorient",null,"Commerce - vente - distribution",null,null,"Vendeur-conseil en magasin"]
["France","Bretagne","Morbihan","Lorient",null,"Bâtiment",null,null,"Maçon du bâti ancien"]
["France","Bretagne","Morbihan","Lorient",null,"Industrie",null,null,"Tourneur en réalisation de pièces mécaniques"]
["France","Bretagne","Morbihan","Lorient",null,"Industrie",null,null,"Fraiseur en réalisation de pièces mécaniques"]
["France","Bretagne","Morbihan","Lorient",null,"Commerce - vente - distribution",null,null,"Assistant commercial"]
["France","Bretagne","Morbihan","Lorient",null,"Industrie",null,null,"Soudeur TIG électrode enrobée"]
["France","Bretagne","Morbihan","Lorient",null,"Industrie",null,null,"Technicien en chaudronnerie"]
["France","Bretagne","Morbihan","Lorient",null,"Bâtiment",null,null,"Chargé d'affaires du bâtiment"]
["France","Bretagne","Morbihan","Lorient",null,"Bâtiment",null,null,"Technicien d'études du bâtiment en dessin de projet"]
["France","Bretagne","Morbihan","Lorient",null,"Bâtiment",null,null,"Coffreur Bancheur"]
["France","Bretagne","Morbihan","Lorient",null,"Bâtiment",null,null,"Conducteur de travaux du bâtiment et du génie civil"]
["France","Bretagne","Morbihan","Lorient",null,"Réseaux - Télécommunications - Informatique - Numérique",null,null,"Technicien supérieur systèmes et réseaux"]
["France","Bretagne","Morbihan","Lorient",null,"Industrie",null,null,"Soudeur assembleur industriel"]
["France","Bretagne","Morbihan","Lorient",null,"Bâtiment",null,null,"Technicien métreur du bâtiment"]
["France","Bretagne","Morbihan","Lorient",null,"Industrie",null,null,"Technicien supérieur de maintenance d’éoliennes"]
["France","Bretagne","Côtes-d'Armor","Loudéac",null,"Transports - logistique",null,null,"Conducteur du transport routier de marchandises sur tous véhicules"]
["France","Bretagne","Côtes-d'Armor","Loudéac",null,"Transports - logistique",null,null,"Conducteur du transport routier de marchandises sur porteur"]
["France","Bretagne","Côtes-d'Armor","Loudéac",null,"Transports - logistique",null,null,"Conducteur de transport en commun sur route"]
["France","Bretagne","Côtes-d'Armor","Loudéac",null,"Industrie",null,null,"Carrossier réparateur"]
["France","Bretagne","Côtes-d'Armor","Loudéac",null,"Industrie",null,null,"Peintre en carrosserie"]
["France","Bretagne","Côtes-d'Armor","Loudéac",null,"Industrie",null,null,"Mécanicien réparateur de véhicules industriels"]
["France","Bretagne","Côtes-d'Armor","Loudéac",null,"Industrie",null,null,"Mécanicien(ne) de maintenance automobile"]
["France","Bretagne","Côtes-d'Armor","Loudéac",null,"Transports - logistique",null,null,"Conducteur livreur sur véhicule utilitaire léger"]
["France","Bretagne","Côtes-d'Armor","Loudéac",null,"Transports - logistique",null,null,"Exploitant en transport routier de marchandises"]
["France","Bretagne","Côtes-d'Armor","Loudéac",null,"Industrie",null,null,"Technicien(ne) électromécanicien(ne) automobile"]
["France","Bretagne","Côtes-d'Armor","Loudéac",null,"Transports - logistique",null,null,"Agent magasinier"]
["France","Bretagne","Côtes-d'Armor","Loudéac",null,"Transports - logistique",null,null,"Gestionnaire des opérations de transport routier de marchandises"]
["France","Bretagne","Côtes-d'Armor","Loudéac",null,"Industrie",null,null,"Contrôleur technique de véhicule léger"]
["France","Bretagne","Finistère","Morlaix",null,"Industrie",null,null,"Mécanicien réparateur de motocycles"]
["France","Bretagne","Finistère","Morlaix",null,"Bâtiment",null,null,"Couvreur-zingueur"]
["France","Bretagne","Finistère","Morlaix",null,"Fonctions supports de l'entreprise",null,null,"Gestionnaire comptable et fiscal"]
["France","Bretagne","Finistère","Morlaix",null,"Fonctions supports de l'entreprise",null,null,"Responsable de petite et moyenne structure"]
["France","Bretagne","Finistère","Morlaix",null,"Bâtiment",null,null,"Maçon"]
["France","Bretagne","Finistère","Morlaix",null,"Bâtiment",null,null,"Conducteur de travaux aménagement finitions"]
["France","Bretagne","Finistère","Morlaix",null,"Bâtiment",null,null,"Menuisier agenceur"]
["France","Bretagne","Finistère","Morlaix",null,"Bâtiment",null,null,"Plaquiste-plâtrier"]
["France","Bretagne","Finistère","Morlaix",null,"Bâtiment",null,null,"Agent de maintenance des bâtiments"]
["France","Bretagne","Finistère","Morlaix",null,"Fonctions supports de l'entreprise",null,null,"Secrétaire assistant"]
["France","Bretagne","Finistère","Morlaix",null,"Fonctions supports de l'entreprise",null,null,"Comptable assistant"]
["France","Bretagne","Finistère","Morlaix",null,"Fonctions supports de l'entreprise",null,null,"Secrétaire comptable"]
["France","Bretagne","Finistère","Morlaix",null,"Bâtiment",null,null,"Electricien d'équipement du bâtiment"]
["France","Bretagne","Finistère","Morlaix",null,"Industrie",null,null,"Mécanicien réparateur de matériels agricoles et d'espaces verts option parcs et jardins"]
["France","Bretagne","Finistère","Morlaix",null,"Fonctions supports de l'entreprise",null,null,"Gestionnaire de paie"]
["France","Bretagne","Finistère","Morlaix",null,"Bâtiment",null,null,"Maçon du bâti ancien"]
["France","Bretagne","Finistère","Morlaix",null,"Fonctions supports de l'entreprise",null,null,"Assistant ressources humaines"]
["France","Bretagne","Finistère","Morlaix",null,"Commerce - vente - distribution",null,null,"Assistant commercial"]
["France","Bretagne","Finistère","Morlaix",null,"Fonctions supports de l'entreprise",null,null,"Assistant de direction"]
["France","Bretagne","Finistère","Morlaix",null,"Industrie",null,null,"Soudeur TIG électrode enrobée"]
["France","Bretagne","Finistère","Morlaix",null,"Fonctions supports de l'entreprise",null,null,"Employé administratif et d’accueil"]
["France","Bretagne","Finistère","Morlaix",null,"Bâtiment",null,null,"Menuisier poseur-installateur"]
["France","Bretagne","Finistère","Morlaix",null,"Bâtiment",null,null,"Carreleur-chapiste"]
["France","Bretagne","Finistère","Quimper",null,"Bâtiment",null,null,"Peintre en bâtiment"]
["France","Bretagne","Finistère","Quimper",null,"Bâtiment",null,null,"Couvreur-zingueur"]
["France","Bretagne","Finistère","Quimper",null,"Bâtiment",null,null,"Installateur en thermique et sanitaire"]
["France","Bretagne","Finistère","Quimper",null,"Bâtiment",null,null,"Technicien d’équipement et d’exploitation en électricité"]
["France","Bretagne","Finistère","Quimper",null,"Bâtiment",null,null,"Technicien de maintenance CVC"]
["France","Bretagne","Finistère","Quimper",null,"Bâtiment",null,null,"Plaquiste-plâtrier"]
["France","Bretagne","Finistère","Quimper",null,"Hôtellerie - restauration - tourisme - loisirs",null,null,"Réceptionniste en hôtellerie"]
["France","Bretagne","Finistère","Quimper",null,"Bâtiment",null,null,"Electricien d'équipement du bâtiment"]
["France","Bretagne","Finistère","Quimper",null,"Bâtiment",null,null,"Technicien du bâtiment communicant et connecté"]
["France","Bretagne","Finistère","Quimper",null,"Bâtiment",null,null,"Technicien de maintenance d'équipements de confort climatique"]
["France","Bretagne","Finistère","Quimper",null,"Bâtiment",null,null,"Constructeur bois"]
["France","Bretagne","Finistère","Quimper",null,"Bâtiment",null,null,"Menuisier poseur-installateur"]
["France","Bretagne","Finistère","Quimper",null,"Bâtiment",null,null,"Carreleur-chapiste"]
["France","Bretagne","Ille-et-Vilaine","Rennes",null,"Fonctions supports de l'entreprise",null,null,"Secrétaire assistant médico-social"]
["France","Bretagne","Ille-et-Vilaine","Rennes",null,"Bâtiment",null,null,"Peintre en bâtiment"]
["France","Bretagne","Ille-et-Vilaine","Rennes",null,"Commerce - vente - distribution",null,null,"Assistant manager d’unité marchande"]
["France","Bretagne","Ille-et-Vilaine","Rennes",null,"Bâtiment",null,null,"Maçon en voirie et réseaux divers"]
["France","Bretagne","Ille-et-Vilaine","Rennes",null,"Travaux publics",null,null,"Maçon en voirie et réseaux divers"]
["France","Bretagne","Ille-et-Vilaine","Rennes",null,"Commerce - vente - distribution",null,null,"Manager d’unité marchande"]
["France","Bretagne","Ille-et-Vilaine","Rennes",null,"Bâtiment",null,null,"Installateur en thermique et sanitaire"]
["France","Bretagne","Ille-et-Vilaine","Rennes",null,"Hôtellerie - restauration - tourisme - loisirs",null,null,"Agent(e) de restauration"]
["France","Bretagne","Ille-et-Vilaine","Rennes",null,"Commerce - vente - distribution",null,null,"Employé commercial en magasin"]
["France","Bretagne","Ille-et-Vilaine","Rennes",null,"Bâtiment",null,null,"Maçon"]
["France","Bretagne","Ille-et-Vilaine","Rennes",null,"Bâtiment",null,null,"Plaquiste-plâtrier"]
["France","Bretagne","Ille-et-Vilaine","Rennes",null,"Hôtellerie - restauration - tourisme - loisirs",null,null,"Cuisinier"]
["France","Bretagne","Ille-et-Vilaine","Rennes",null,"Bâtiment",null,null,"Agent de maintenance des bâtiments"]
["France","Bretagne","Ille-et-Vilaine","Rennes",null,"Fonctions supports de l'entreprise",null,null,"Secrétaire assistant"]
["France","Bretagne","Ille-et-Vilaine","Rennes",null,"Bâtiment",null,null,"Façadier-peintre"]
["France","Bretagne","Ille-et-Vilaine","Rennes",null,"Réseaux - Télécommunications - Informatique - Numérique",null,null,"Installateur de réseaux de télécommunications"]
["France","Bretagne","Ille-et-Vilaine","Rennes",null,"Travaux publics",null,null,"Canalisateur"]
["France","Bretagne","Ille-et-Vilaine","Rennes",null,"Bâtiment",null,null,"Electricien d'équipement du bâtiment"]
["France","Bretagne","Ille-et-Vilaine","Rennes",null,"Réseaux - Télécommunications - Informatique - Numérique",null,null,"Technicien de réseaux de télécommunications"]
["France","Bretagne","Ille-et-Vilaine","Rennes",null,"Hôtellerie - restauration - tourisme - loisirs",null,null,"Responsable d'unité de restauration collective"]
["France","Bretagne","Ille-et-Vilaine","Rennes",null,"Commerce - vente - distribution",null,null,"Conseiller relation client à distance"]
["France","Bretagne","Ille-et-Vilaine","Rennes",null,"Commerce - vente - distribution",null,null,"Vendeur-conseil en magasin"]
["France","Bretagne","Ille-et-Vilaine","Rennes",null,"Fonctions supports de l'entreprise",null,null,"Gestionnaire de paie"]
["France","Bretagne","Ille-et-Vilaine","Rennes",null,"Bâtiment",null,null,"Maçon du bâti ancien"]
["France","Bretagne","Ille-et-Vilaine","Rennes",null,"Fonctions supports de l'entreprise",null,null,"Assistant de direction"]
["France","Bretagne","Ille-et-Vilaine","Rennes",null,"Bâtiment",null,null,"Coffreur Bancheur"]
["France","Bretagne","Côtes-d'Armor","Saint Brieuc Langueux",null,"Bâtiment",null,null,"Peintre en bâtiment"]
["France","Bretagne","Côtes-d'Armor","Saint Brieuc Langueux",null,"Bâtiment",null,null,"Maçon en voirie et réseaux divers"]
["France","Bretagne","Côtes-d'Armor","Saint Brieuc Langueux",null,"Travaux publics",null,null,"Maçon en voirie et réseaux divers"]
["France","Bretagne","Côtes-d'Armor","Saint Brieuc Langueux",null,"Bâtiment",null,null,"Couvreur-zingueur"]
["France","Bretagne","Côtes-d'Armor","Saint Brieuc Langueux",null,"Industrie",null,null,"Technicien d’après-vente en électroménager et audiovisuel à domicile"]
["France","Bretagne","Côtes-d'Armor","Saint Brieuc Langueux",null,"Bâtiment",null,null,"Installateur en thermique et sanitaire"]
["France","Bretagne","Côtes-d'Armor","Saint Brieuc Langueux",null,"Hôtellerie - restauration - tourisme - loisirs",null,null,"Agent(e) de restauration"]
["France","Bretagne","Côtes-d'Armor","Saint Brieuc Langueux",null,"Commerce - vente - distribution",null,null,"Employé commercial en magasin"]
["France","Bretagne","Côtes-d'Armor","Saint Brieuc Langueux",null,"Bâtiment",null,null,"Maçon"]
["France","Bretagne","Côtes-d'Armor","Saint Brieuc Langueux",null,"Bâtiment",null,null,"Menuisier agenceur"]
["France","Bretagne","Côtes-d'Armor","Saint Brieuc Langueux",null,"Bâtiment",null,null,"Plaquiste-plâtrier"]
["France","Bretagne","Côtes-d'Armor","Saint Brieuc Langueux",null,"Fonctions supports de l'entreprise",null,null,"Formateur professionnel d'adultes"]
["France","Bretagne","Côtes-d'Armor","Saint Brieuc Langueux",null,"Bâtiment",null,null,"Agent de maintenance des bâtiments"]
["France","Bretagne","Côtes-d'Armor","Saint Brieuc Langueux",null,"Fonctions supports de l'entreprise",null,null,"Secrétaire assistant"]
["France","Bretagne","Côtes-d'Armor","Saint Brieuc Langueux",null,"Fonctions supports de l'entreprise",null,null,"Comptable assistant"]
["France","Bretagne","Côtes-d'Armor","Saint Brieuc Langueux",null,"Fonctions supports de l'entreprise",null,null,"Secrétaire comptable"]
["France","Bretagne","Côtes-d'Armor","Saint Brieuc Langueux",null,"Insertion et de la médiation",null,null,"Conseiller en insertion professionnelle"]
["France","Bretagne","Côtes-d'Armor","Saint Brieuc Langueux",null,"Bâtiment",null,null,"Electricien d'équipement du bâtiment"]
["France","Bretagne","Côtes-d'Armor","Saint Brieuc Langueux",null,"Réseaux - Télécommunications - Informatique - Numérique",null,null,"Technicien d'assistance en informatique"]
["France","Bretagne","Côtes-d'Armor","Saint Brieuc Langueux",null,"Commerce - vente - distribution",null,null,"Vendeur-conseil en magasin"]
["France","Bretagne","Côtes-d'Armor","Saint Brieuc Langueux",null,"Bâtiment",null,null,"Maçon du bâti ancien"]
["France","Bretagne","Côtes-d'Armor","Saint Brieuc Langueux",null,"Réseaux - Télécommunications - Informatique - Numérique",null,null,"Concepteur développeur d’applications"]
["France","Bretagne","Côtes-d'Armor","Saint Brieuc Langueux",null,"Commerce - vente - distribution",null,null,"Assistant commercial"]
["France","Bretagne","Côtes-d'Armor","Saint Brieuc Langueux",null,"Fonctions supports de l'entreprise",null,null,"Employé administratif et d’accueil"]
["France","Bretagne","Côtes-d'Armor","Saint Brieuc Langueux",null,"Bâtiment",null,null,"Menuisier poseur-installateur"]
["France","Bretagne","Côtes-d'Armor","Saint Brieuc Langueux",null,"Réseaux - Télécommunications - Informatique - Numérique",null,null,"Technicien supérieur systèmes et réseaux"]
["France","Bretagne","Côtes-d'Armor","Saint Brieuc Langueux",null,"Réseaux - Télécommunications - Informatique - Numérique",null,null,"Administrateur d’infrastructures sécurisées"]
["France","Bretagne","Ille-et-Vilaine","Saint Malo",null,"Bâtiment",null,null,"Solier moquettiste"]
["France","Bretagne","Ille-et-Vilaine","Saint Malo",null,"Bâtiment",null,null,"Peintre en bâtiment"]
["France","Bretagne","Ille-et-Vilaine","Saint Malo",null,"Bâtiment",null,null,"Couvreur-zingueur"]
["France","Bretagne","Ille-et-Vilaine","Saint Malo",null,"Bâtiment",null,null,"Technicien d'études en construction bois"]
["France","Bretagne","Ille-et-Vilaine","Saint Malo",null,"Bâtiment",null,null,"Maçon"]
["France","Bretagne","Ille-et-Vilaine","Saint Malo",null,"Bâtiment",null,null,"Menuisier agenceur"]
["France","Bretagne","Ille-et-Vilaine","Saint Malo",null,"Bâtiment",null,null,"Agent de maintenance des bâtiments"]
["France","Bretagne","Ille-et-Vilaine","Saint Malo",null,"Hôtellerie - restauration - tourisme - loisirs",null,null,"Réceptionniste en hôtellerie"]
["France","Bretagne","Ille-et-Vilaine","Saint Malo",null,"Bâtiment",null,null,"Métallier"]
["France","Bretagne","Ille-et-Vilaine","Saint Malo",null,"Bâtiment",null,null,"Charpentier bois"]
["France","Bretagne","Ille-et-Vilaine","Saint Malo",null,"Bâtiment",null,null,"Constructeur bois"]
["France","Bretagne","Ille-et-Vilaine","Saint Malo",null,"Bâtiment",null,null,"Menuisier poseur-installateur"]
["France","Bretagne","Ille-et-Vilaine","Saint Malo",null,"Bâtiment",null,null,"Carreleur-chapiste"]
["France","Centre-Val de Loire","Cher","Bourges",null,"Bâtiment",null,null,"Peintre en bâtiment"]
["France","Centre-Val de Loire","Cher","Bourges",null,"Bâtiment",null,null,"Maçon en voirie et réseaux divers"]
["France","Centre-Val de Loire","Cher","Bourges",null,"Travaux publics",null,null,"Maçon en voirie et réseaux divers"]
["France","Centre-Val de Loire","Cher","Bourges",null,"Bâtiment",null,null,"Installateur en thermique et sanitaire"]
["France","Centre-Val de Loire","Cher","Bourges",null,"Industrie",null,null,"Technicien en usinage assisté par ordinateur"]
["France","Centre-Val de Loire","Cher","Bourges",null,"Bâtiment",null,null,"Maçon"]
["France","Centre-Val de Loire","Cher","Bourges",null,"Travaux publics",null,null,"Conducteur d’engins de chantiers urbains"]
["France","Centre-Val de Loire","Cher","Bourges",null,"Hôtellerie - restauration - tourisme - loisirs",null,null,"Employé d’étage en hôtellerie"]
["France","Centre-Val de Loire","Cher","Bourges",null,"Bâtiment",null,null,"Plaquiste-plâtrier"]
["France","Centre-Val de Loire","Cher","Bourges",null,"Bâtiment",null,null,"Agent de maintenance des bâtiments"]
["France","Centre-Val de Loire","Cher","Bourges",null,"Bâtiment",null,null,"Façadier-peintre"]
["France","Centre-Val de Loire","Cher","Bourges",null,"Services aux entreprises et à la personne",null,null,"Assistant de vie aux familles"]
["France","Centre-Val de Loire","Cher","Bourges",null,"Services aux entreprises et à la personne",null,null,"Agent de propreté et d'hygiène"]
["France","Centre-Val de Loire","Cher","Bourges",null,"Bâtiment",null,null,"Electricien d'équipement du bâtiment"]
["France","Centre-Val de Loire","Cher","Bourges",null,"Bâtiment",null,null,"Maçon du bâti ancien"]
["France","Centre-Val de Loire","Cher","Bourges",null,"Industrie",null,null,"Tourneur en réalisation de pièces mécaniques"]
["France","Centre-Val de Loire","Cher","Bourges",null,"Industrie",null,null,"Fraiseur en réalisation de pièces mécaniques"]
["France","Centre-Val de Loire","Cher","Bourges",null,"Hôtellerie - restauration - tourisme - loisirs",null,null,"Animateur loisir tourisme"]
["France","Centre-Val de Loire","Cher","Bourges",null,"Bâtiment",null,null,"Menuisier poseur-installateur"]
["France","Centre-Val de Loire","Cher","Bourges",null,"Industrie",null,null,"Soudeur assembleur industriel"]
["France","Centre-Val de Loire","Cher","Bourges",null,"Services aux entreprises et à la personne",null,null,"Agent de service médico-social"]
["France","Centre-Val de Loire","Cher","Bourges",null,"Bâtiment",null,null,"Carreleur-chapiste"]
["France","Centre-Val de Loire","Eure-et-Loir","Chartres",null,"Industrie",null,null,"Mécanicien(ne) automobile"]
["France","Centre-Val de Loire","Eure-et-Loir","Chartres",null,"Bâtiment",null,null,"Peintre en bâtiment"]
["France","Centre-Val de Loire","Eure-et-Loir","Chartres",null,"Industrie",null,null,"Peintre en carrosserie"]
["France","Centre-Val de Loire","Eure-et-Loir","Chartres",null,"Bâtiment",null,null,"Installateur en thermique et sanitaire"]
["France","Centre-Val de Loire","Eure-et-Loir","Chartres",null,"Industrie",null,null,"Conducteur d'installation et de machines automatisées"]
["France","Centre-Val de Loire","Eure-et-Loir","Chartres",null,"Commerce - vente - distribution",null,null,"Employé commercial en magasin"]
["France","Centre-Val de Loire","Eure-et-Loir","Chartres",null,"Industrie",null,null,"Technicien supérieur de maintenance industrielle"]
["France","Centre-Val de Loire","Eure-et-Loir","Chartres",null,"Industrie",null,null,"Technicien(ne) supérieur(e) de maintenance industrielle"]
["France","Centre-Val de Loire","Eure-et-Loir","Chartres",null,"Artisanat d'art",null,null,"Restaurateur de meubles d’art, anciens et contemporains"]
["France","Centre-Val de Loire","Eure-et-Loir","Chartres",null,"Bâtiment",null,null,"Menuisier agenceur"]
["France","Centre-Val de Loire","Eure-et-Loir","Chartres",null,"Industrie",null,null,"Technicien de production industrielle"]
["France","Centre-Val de Loire","Eure-et-Loir","Chartres",null,"Bâtiment",null,null,"Agent de maintenance des bâtiments"]
["France","Centre-Val de Loire","Eure-et-Loir","Chartres",null,"Fonctions supports de l'entreprise",null,null,"Comptable assistant"]
["France","Centre-Val de Loire","Eure-et-Loir","Chartres",null,"Insertion et de la médiation",null,null,"Conseiller en insertion professionnelle"]
["France","Centre-Val de Loire","Eure-et-Loir","Chartres",null,"Industrie",null,null,"Technicien de maintenance d'engins et de matériels ''machinisme agricole''"]
["France","Centre-Val de Loire","Eure-et-Loir","Chartres",null,"Industrie",null,null,"Technicien de maintenance industrielle"]
["France","Centre-Val de Loire","Eure-et-Loir","Chartres",null,"Industrie",null,null,"Technicien(ne) électromécanicien(ne) automobile"]
["France","Centre-Val de Loire","Eure-et-Loir","Chartres",null,"Bâtiment",null,null,"Electricien d'équipement du bâtiment"]
["France","Centre-Val de Loire","Eure-et-Loir","Chartres",null,"Industrie",null,null,"Mécanicien réparateur de matériels agricoles et d'espaces verts option machinisme agricole"]
["France","Centre-Val de Loire","Eure-et-Loir","Chartres",null,"Artisanat d'art",null,null,"Tapissier garnisseur"]
["France","Centre-Val de Loire","Eure-et-Loir","Chartres",null,"Réseaux - Télécommunications - Informatique - Numérique",null,null,"Développeur web et web mobile"]
["France","Centre-Val de Loire","Eure-et-Loir","Chartres",null,"Industrie",null,null,"Soudeur TIG électrode enrobée"]
["France","Centre-Val de Loire","Eure-et-Loir","Chartres",null,"Bâtiment",null,null,"Technicien d'installation en équipements de confort climatique"]
["France","Centre-Val de Loire","Eure-et-Loir","Chartres",null,"Industrie",null,null,"Soudeur assembleur industriel"]
["France","Centre-Val de Loire","Indre","Issoudun",null,"Fonctions supports de l'entreprise",null,null,"Infographiste metteur en page"]
["France","Centre-Val de Loire","Indre","Issoudun",null,"Fonctions supports de l'entreprise",null,null,"Formateur professionnel d'adultes"]
["France","Centre-Val de Loire","Indre","Issoudun",null,"Services aux entreprises et à la personne",null,null,"Assistant de vie aux familles"]
["France","Centre-Val de Loire","Indre","Issoudun",null,"Insertion et de la médiation",null,null,"Conseiller en insertion professionnelle"]
["France","Centre-Val de Loire","Indre","Issoudun",null,"Fonctions supports de l'entreprise",null,null,"Monteur / monteuse audiovisuel"]
["France","Centre-Val de Loire","Indre","Issoudun",null,"Services aux entreprises et à la personne",null,null,"Responsable-coordonnateur services au domicile"]
["France","Centre-Val de Loire","Indre","Issoudun",null,"Réseaux - Télécommunications - Informatique - Numérique",null,null,"Concepteur designer UI"]
["France","Centre-Val de Loire","Loiret","Montargis",null,"Bâtiment",null,null,"Couvreur-zingueur"]
["France","Centre-Val de Loire","Loiret","Montargis",null,"Bâtiment",null,null,"Installateur en thermique et sanitaire"]
["France","Centre-Val de Loire","Loiret","Montargis",null,"Commerce - vente - distribution",null,null,"Employé commercial en magasin"]
["France","Centre-Val de Loire","Loiret","Montargis",null,"Commerce - vente - distribution",null,null,"Vendeur-conseil en magasin"]
["France","Centre-Val de Loire","Loiret","Orléans Olivet",null,"Bâtiment",null,null,"Peintre en bâtiment"]
["France","Centre-Val de Loire","Loiret","Orléans Olivet",null,"Travaux publics",null,null,"Maçon en voirie et réseaux divers"]
["France","Centre-Val de Loire","Loiret","Orléans Olivet",null,"Commerce - vente - distribution",null,null,"Manager d’unité marchande"]
["France","Centre-Val de Loire","Loiret","Orléans Olivet",null,"Bâtiment",null,null,"Installateur en thermique et sanitaire"]
["France","Centre-Val de Loire","Loiret","Orléans Olivet",null,"Hôtellerie - restauration - tourisme - loisirs",null,null,"Agent(e) de restauration"]
["France","Centre-Val de Loire","Loiret","Orléans Olivet",null,"Bâtiment",null,null,"Maçon"]
["France","Centre-Val de Loire","Loiret","Orléans Olivet",null,"Hôtellerie - restauration - tourisme - loisirs",null,null,"Employé d’étage en hôtellerie"]
["France","Centre-Val de Loire","Loiret","Orléans Olivet",null,"Commerce - vente - distribution",null,null,"Employé technicien-vendeur en matériel de sport"]
["France","Centre-Val de Loire","Loiret","Orléans Olivet",null,"Hôtellerie - restauration - tourisme - loisirs",null,null,"Serveur en restauration"]
["France","Centre-Val de Loire","Loiret","Orléans Olivet",null,"Bâtiment",null,null,"Plaquiste-plâtrier"]
["France","Centre-Val de Loire","Loiret","Orléans Olivet",null,"Commerce - vente - distribution",null,null,"Négociateur technico-commercial"]
["France","Centre-Val de Loire","Loiret","Orléans Olivet",null,"Fonctions supports de l'entreprise",null,null,"Formateur professionnel d'adultes"]
["France","Centre-Val de Loire","Loiret","Orléans Olivet",null,"Hôtellerie - restauration - tourisme - loisirs",null,null,"Cuisinier"]
["France","Centre-Val de Loire","Loiret","Orléans Olivet",null,"Hôtellerie - restauration - tourisme - loisirs",null,null,"Réceptionniste en hôtellerie"]
["France","Centre-Val de Loire","Loiret","Orléans Olivet",null,"Services aux entreprises et à la personne",null,null,"Agent de propreté et d'hygiène"]
["France","Centre-Val de Loire","Loiret","Orléans Olivet",null,"Insertion et de la médiation",null,null,"Conseiller en insertion professionnelle"]
["France","Centre-Val de Loire","Loiret","Orléans Olivet",null,"Réseaux - Télécommunications - Informatique - Numérique",null,null,"Installateur de réseaux de télécommunications"]
["France","Centre-Val de Loire","Loiret","Orléans Olivet",null,"Insertion et de la médiation",null,null,"Encadrant technique d'insertion"]
["France","Centre-Val de Loire","Loiret","Orléans Olivet",null,"Services aux entreprises et à la personne",null,null,"Ouvrier du paysage"]
["France","Centre-Val de Loire","Loiret","Orléans Olivet",null,"Bâtiment",null,null,"Electricien d'équipement du bâtiment"]
["France","Centre-Val de Loire","Loiret","Orléans Olivet",null,"Transports - logistique",null,null,"Préparateur de commandes en entrepôt"]
["France","Centre-Val de Loire","Loiret","Orléans Olivet",null,"Réseaux - Télécommunications - Informatique - Numérique",null,null,"Technicien de réseaux de télécommunications"]
["France","Centre-Val de Loire","Loiret","Orléans Olivet",null,"Réseaux - Télécommunications - Informatique - Numérique",null,null,"Technicien d'assistance en informatique"]
["France","Centre-Val de Loire","Loiret","Orléans Olivet",null,"Commerce - vente - distribution",null,null,"Conseiller relation client à distance"]
["France","Centre-Val de Loire","Loiret","Orléans Olivet",null,"Commerce - vente - distribution",null,null,"Assistant import-export"]
["France","Centre-Val de Loire","Loiret","Orléans Olivet",null,"Hôtellerie - restauration - tourisme - loisirs",null,null,"Conseiller vendeur en voyages"]
["France","Centre-Val de Loire","Loiret","Orléans Olivet",null,"Commerce - vente - distribution",null,null,"Manager d’équipe relation client à distance"]
["France","Centre-Val de Loire","Loiret","Orléans Olivet",null,"Réseaux - Télécommunications - Informatique - Numérique",null,null,"Développeur web et web mobile"]
["France","Centre-Val de Loire","Loiret","Orléans Olivet",null,"Fonctions supports de l'entreprise",null,null,"Assistant ressources humaines"]
["France","Centre-Val de Loire","Loiret","Orléans Olivet",null,"Commerce - vente - distribution",null,null,"Assistant commercial"]
["France","Centre-Val de Loire","Loiret","Orléans Olivet",null,"Bâtiment",null,null,"Chargé d'affaires du bâtiment"]
["France","Centre-Val de Loire","Loiret","Orléans Olivet",null,"Réseaux - Télécommunications - Informatique - Numérique",null,null,"Technicien supérieur systèmes et réseaux"]
["France","Centre-Val de Loire","Loiret","Orléans Olivet",null,"Bâtiment",null,null,"BIM modeleur du bâtiment"]
["France","Centre-Val de Loire","Indre-et-Loire","Tours St Symphorien",null,"Bâtiment",null,null,"Peintre en bâtiment"]
["France","Centre-Val de Loire","Indre-et-Loire","Tours St Symphorien",null,"Fonctions supports de l'entreprise",null,null,"Gestionnaire comptable et fiscal"]
["France","Centre-Val de Loire","Indre-et-Loire","Tours St Symphorien",null,"Bâtiment",null,null,"Installateur en thermique et sanitaire"]
["France","Centre-Val de Loire","Indre-et-Loire","Tours St Symphorien",null,"Hôtellerie - restauration - tourisme - loisirs",null,null,"Agent(e) de restauration"]
["France","Centre-Val de Loire","Indre-et-Loire","Tours St Symphorien",null,"Commerce - vente - distribution",null,null,"Employé commercial en magasin"]
["France","Centre-Val de Loire","Indre-et-Loire","Tours St Symphorien",null,"Industrie",null,null,"Electricien d’installation et de maintenance des systèmes automatisés"]
["France","Centre-Val de Loire","Indre-et-Loire","Tours St Symphorien",null,"Hôtellerie - restauration - tourisme - loisirs",null,null,"Employé d’étage en hôtellerie"]
["France","Centre-Val de Loire","Indre-et-Loire","Tours St Symphorien",null,"Bâtiment",null,null,"Menuisier agenceur"]
["France","Centre-Val de Loire","Indre-et-Loire","Tours St Symphorien",null,"Transports - logistique",null,null,"Conducteur livreur sur véhicule utilitaire léger"]
["France","Centre-Val de Loire","Indre-et-Loire","Tours St Symphorien",null,"Hôtellerie - restauration - tourisme - loisirs",null,null,"Serveur en restauration"]
["France","Centre-Val de Loire","Indre-et-Loire","Tours St Symphorien",null,"Bâtiment",null,null,"Plaquiste-plâtrier"]
["France","Centre-Val de Loire","Indre-et-Loire","Tours St Symphorien",null,"Fonctions supports de l'entreprise",null,null,"Formateur professionnel d'adultes"]
["France","Centre-Val de Loire","Indre-et-Loire","Tours St Symphorien",null,"Hôtellerie - restauration - tourisme - loisirs",null,null,"Cuisinier"]
["France","Centre-Val de Loire","Indre-et-Loire","Tours St Symphorien",null,"Bâtiment",null,null,"Agent de maintenance des bâtiments"]
["France","Centre-Val de Loire","Indre-et-Loire","Tours St Symphorien",null,"Hôtellerie - restauration - tourisme - loisirs",null,null,"Réceptionniste en hôtellerie"]
["France","Centre-Val de Loire","Indre-et-Loire","Tours St Symphorien",null,"Fonctions supports de l'entreprise",null,null,"Comptable assistant"]
["France","Centre-Val de Loire","Indre-et-Loire","Tours St Symphorien",null,"Services aux entreprises et à la personne",null,null,"Agent de propreté et d'hygiène"]
["France","Centre-Val de Loire","Indre-et-Loire","Tours St Symphorien",null,"Industrie",null,null,"Technicien de maintenance industrielle"]
["France","Centre-Val de Loire","Indre-et-Loire","Tours St Symphorien",null,"Bâtiment",null,null,"Electricien d'équipement du bâtiment"]
["France","Centre-Val de Loire","Indre-et-Loire","Tours St Symphorien",null,"Commerce - vente - distribution",null,null,"Conseiller relation client à distance"]
["France","Centre-Val de Loire","Indre-et-Loire","Tours St Symphorien",null,"Commerce - vente - distribution",null,null,"Vendeur-conseil en magasin"]
["France","Centre-Val de Loire","Indre-et-Loire","Tours St Symphorien",null,"Hôtellerie - restauration - tourisme - loisirs",null,null,"Animateur loisir tourisme"]
["France","Centre-Val de Loire","Indre-et-Loire","Tours St Symphorien",null,"Bâtiment",null,null,"Technicien d'installation en équipements de confort climatique"]
["France","Centre-Val de Loire","Indre-et-Loire","Tours St Symphorien",null,"Industrie",null,null,"Soudeur assembleur industriel"]
["France","Centre-Val de Loire","Indre-et-Loire","Tours St Symphorien",null,"Bâtiment",null,null,"Carreleur-chapiste"]
["France","Centre-Val de Loire","Indre-et-Loire","Tours St Symphorien",null,"Hôtellerie - restauration - tourisme - loisirs",null,null,"Responsable d'établissement touristique"]
["France","Centre-Val de Loire","Loir-et-Cher","Blois 2.0",null,"Fonctions supports de l'entreprise",null,null,"Secrétaire assistant médico-social"]
["France","Centre-Val de Loire","Loir-et-Cher","Blois 2.0",null,"Bâtiment",null,null,"Installateur en thermique et sanitaire"]
["France","Centre-Val de Loire","Loir-et-Cher","Blois 2.0",null,"Fonctions supports de l'entreprise",null,null,"Formateur professionnel d'adultes"]
["France","Centre-Val de Loire","Loir-et-Cher","Blois 2.0",null,"Bâtiment",null,null,"Chargé d'affaires en rénovation énergétique du bâtiment"]
["France","Centre-Val de Loire","Loir-et-Cher","Blois 2.0",null,"Réseaux - Télécommunications - Informatique - Numérique",null,null,"Technicien supérieur systèmes et réseaux"]
["France","Centre-Val de Loire","Loir-et-Cher","Blois 2.0",null,"Réseaux - Télécommunications - Informatique - Numérique",null,null,"Administrateur d’infrastructures sécurisées"]
["France","Corse","Corse-du-Sud","Ajaccio Yolanda",null,"Fonctions supports de l'entreprise",null,null,"Secrétaire assistant médico-social"]
["France","Corse","Corse-du-Sud","Ajaccio Yolanda",null,"Travaux publics",null,null,"Maçon en voirie et réseaux divers"]
["France","Corse","Corse-du-Sud","Ajaccio Yolanda",null,"Fonctions supports de l'entreprise",null,null,"Gestionnaire comptable et fiscal"]
["France","Corse","Corse-du-Sud","Ajaccio Yolanda",null,"Hôtellerie - restauration - tourisme - loisirs",null,null,"Agent(e) de restauration"]
["France","Corse","Corse-du-Sud","Ajaccio Yolanda",null,"Bâtiment",null,null,"Menuisier agenceur"]
["France","Corse","Corse-du-Sud","Ajaccio Yolanda",null,"Fonctions supports de l'entreprise",null,null,"Infographiste metteur en page"]
["France","Corse","Corse-du-Sud","Ajaccio Yolanda",null,"Réseaux - Télécommunications - Informatique - Numérique",null,null,"Installateur dépanneur en informatique"]
["France","Corse","Corse-du-Sud","Ajaccio Yolanda",null,"Hôtellerie - restauration - tourisme - loisirs",null,null,"Serveur en restauration"]
["France","Corse","Corse-du-Sud","Ajaccio Yolanda",null,"Hôtellerie - restauration - tourisme - loisirs",null,null,"Gouvernant en hôtellerie"]
["France","Corse","Corse-du-Sud","Ajaccio Yolanda",null,"Bâtiment",null,null,"Plaquiste-plâtrier"]
["France","Corse","Corse-du-Sud","Ajaccio Yolanda",null,"Hôtellerie - restauration - tourisme - loisirs",null,null,"Cuisinier"]
["France","Corse","Corse-du-Sud","Ajaccio Yolanda",null,"Fonctions supports de l'entreprise",null,null,"Secrétaire assistant"]
["France","Corse","Corse-du-Sud","Ajaccio Yolanda",null,"Hôtellerie - restauration - tourisme - loisirs",null,null,"Réceptionniste en hôtellerie"]
["France","Corse","Corse-du-Sud","Ajaccio Yolanda",null,"Fonctions supports de l'entreprise",null,null,"Comptable assistant"]
["France","Corse","Corse-du-Sud","Ajaccio Yolanda",null,"Services aux entreprises et à la personne",null,null,"Assistant de vie aux familles"]
["France","Corse","Corse-du-Sud","Ajaccio Yolanda",null,"Fonctions supports de l'entreprise",null,null,"Secrétaire comptable"]
["France","Corse","Corse-du-Sud","Ajaccio Yolanda",null,"Commerce - vente - distribution",null,null,"Vendeur-conseil en magasin"]
["France","Corse","Corse-du-Sud","Ajaccio Yolanda",null,"Fonctions supports de l'entreprise",null,null,"Gestionnaire de paie"]
["France","Corse","Corse-du-Sud","Ajaccio Yolanda",null,"Fonctions supports de l'entreprise",null,null,"Assistant ressources humaines"]
["France","Corse","Corse-du-Sud","Ajaccio Yolanda",null,"Fonctions supports de l'entreprise",null,null,"Employé administratif et d’accueil"]
["France","Corse","Corse-du-Sud","Ajaccio Yolanda",null,"Hôtellerie - restauration - tourisme - loisirs",null,null,"Guide accompagnateur touristique"]
["France","Corse","Corse-du-Sud","Ajaccio Yolanda",null,"Bâtiment",null,null,"Menuisier poseur-installateur"]
["France","Corse","Corse-du-Sud","Ajaccio Yolanda",null,"Hôtellerie - restauration - tourisme - loisirs",null,null,"Chargé d’accueil touristique et de loisirs"]
["France","Corse","Haute-Corse","Bastia Borgo",null,"Bâtiment",null,null,"Maçon en voirie et réseaux divers"]
["France","Corse","Haute-Corse","Bastia Borgo",null,"Travaux publics",null,null,"Maçon en voirie et réseaux divers"]
["France","Corse","Haute-Corse","Bastia Borgo",null,"Fonctions supports de l'entreprise",null,null,"Gestionnaire comptable et fiscal"]
["France","Corse","Haute-Corse","Bastia Borgo",null,"Fonctions supports de l'entreprise",null,null,"Responsable de petite et moyenne structure"]
["France","Corse","Haute-Corse","Bastia Borgo",null,"Travaux publics",null,null,"Conducteur d’engins de chantiers urbains"]
["France","Corse","Haute-Corse","Bastia Borgo",null,"Fonctions supports de l'entreprise",null,null,"Infographiste metteur en page"]
["France","Corse","Haute-Corse","Bastia Borgo",null,"Fonctions supports de l'entreprise",null,null,"Secrétaire assistant"]
["France","Corse","Haute-Corse","Bastia Borgo",null,"Hôtellerie - restauration - tourisme - loisirs",null,null,"Réceptionniste en hôtellerie"]
["France","Corse","Haute-Corse","Bastia Borgo",null,"Fonctions supports de l'entreprise",null,null,"Comptable assistant"]
["France","Corse","Haute-Corse","Bastia Borgo",null,"Fonctions supports de l'entreprise",null,null,"Secrétaire comptable"]
["France","Corse","Haute-Corse","Bastia Borgo",null,"Travaux publics",null,null,"Canalisateur"]
["France","Corse","Haute-Corse","Corte",null,"Bâtiment",null,null,"Maçon en voirie et réseaux divers"]
["France","Corse","Haute-Corse","Corte",null,"Travaux publics",null,null,"Maçon en voirie et réseaux divers"]
["France","Corse","Haute-Corse","Corte",null,"Bâtiment",null,null,"Installateur en thermique et sanitaire"]
["France","Corse","Haute-Corse","Corte",null,"Bâtiment",null,null,"Maçon"]
["France","Corse","Haute-Corse","Corte",null,"Industrie",null,null,"Mécanicien(ne) de maintenance automobile"]
["France","Corse","Haute-Corse","Corte",null,"Industrie",null,null,"Technicien de traitement des eaux"]
["France","Corse","Haute-Corse","Corte",null,"Travaux publics",null,null,"Monteur de réseaux électriques aéro-souterrains"]
["France","Corse","Haute-Corse","Corte",null,"Fonctions supports de l'entreprise",null,null,"Secrétaire assistant"]
["France","Corse","Haute-Corse","Corte",null,"Hôtellerie - restauration - tourisme - loisirs",null,null,"Réceptionniste en hôtellerie"]
["France","Corse","Haute-Corse","Corte",null,"Services aux entreprises et à la personne",null,null,"Assistant de vie aux familles"]
["France","Corse","Haute-Corse","Corte",null,"Insertion et de la médiation",null,null,"Conseiller en insertion professionnelle"]
["France","Corse","Haute-Corse","Corte",null,"Industrie",null,null,"Technicien(ne) électromécanicien(ne) automobile"]
["France","Corse","Haute-Corse","Corte",null,"Insertion et de la médiation",null,null,"Encadrant technique d'insertion"]
["France","Corse","Haute-Corse","Corte",null,"Travaux publics",null,null,"Canalisateur"]
["France","Corse","Haute-Corse","Corte",null,"Bâtiment",null,null,"Electricien d'équipement du bâtiment"]
["France","Corse","Haute-Corse","Corte",null,"Réseaux - Télécommunications - Informatique - Numérique",null,null,"Technicien de réseaux de télécommunications"]
["France","Corse","Haute-Corse","Corte",null,"Fonctions supports de l'entreprise",null,null,"Gestionnaire de paie"]
["France","Corse","Haute-Corse","Corte",null,"Industrie",null,null,"Agent technique de réception et de valorisation de déchets"]
["France","Corse","Haute-Corse","Corte",null,"Bâtiment",null,null,"Monteur dépanneur en climatisation"]
["France","Corse","Haute-Corse","Corte",null,"Bâtiment",null,null,"Chargé d'affaires en rénovation énergétique du bâtiment"]
["France","Corse","Haute-Corse","Corte",null,"Bâtiment",null,null,"Technicien d'installation en équipements de confort climatique"]
["France","Corse","Haute-Corse","Corte",null,"Bâtiment",null,null,"BIM modeleur du bâtiment"]
["France","Corse","Haute-Corse","Corte",null,"Services aux entreprises et à la personne",null,null,"Responsable-coordonnateur services au domicile"]
["France","Grand Est","Ardennes","Charleville Montcy",null,"Bâtiment",null,null,"Peintre en bâtiment"]
["France","Grand Est","Ardennes","Charleville Montcy",null,"Fonctions supports de l'entreprise",null,null,"Gestionnaire comptable et fiscal"]
["France","Grand Est","Ardennes","Charleville Montcy",null,"Bâtiment",null,null,"Installateur en thermique et sanitaire"]
["France","Grand Est","Ardennes","Charleville Montcy",null,"Industrie",null,null,"Technicien en usinage assisté par ordinateur"]
["France","Grand Est","Ardennes","Charleville Montcy",null,"Bâtiment",null,null,"Maçon"]
["France","Grand Est","Ardennes","Charleville Montcy",null,"Bâtiment",null,null,"Plaquiste-plâtrier"]
["France","Grand Est","Ardennes","Charleville Montcy",null,"Bâtiment",null,null,"Agent de maintenance des bâtiments"]
["France","Grand Est","Ardennes","Charleville Montcy",null,"Bâtiment",null,null,"Façadier-peintre"]
["France","Grand Est","Ardennes","Charleville Montcy",null,"Services aux entreprises et à la personne",null,null,"Assistant de vie aux familles"]
["France","Grand Est","Ardennes","Charleville Montcy",null,"Insertion et de la médiation",null,null,"Conseiller en insertion professionnelle"]
["France","Grand Est","Ardennes","Charleville Montcy",null,"Bâtiment",null,null,"Electricien d'équipement du bâtiment"]
["France","Grand Est","Ardennes","Charleville Montcy",null,"Commerce - vente - distribution",null,null,"Conseiller relation client à distance"]
["France","Grand Est","Ardennes","Charleville Montcy",null,"Bâtiment",null,null,"Technicien de maintenance d'équipements de confort climatique"]
["France","Grand Est","Ardennes","Charleville Montcy",null,"Industrie",null,null,"Opérateur régleur en usinage assisté par ordinateur"]
["France","Grand Est","Ardennes","Charleville Montcy",null,"Fonctions supports de l'entreprise",null,null,"Gestionnaire de paie"]
["France","Grand Est","Ardennes","Charleville Montcy",null,"Industrie",null,null,"Soudeur TIG électrode enrobée"]
["France","Grand Est","Ardennes","Charleville Montcy",null,"Bâtiment",null,null,"Technicien d'installation en équipements de confort climatique"]
["France","Grand Est","Ardennes","Charleville Montcy",null,"Industrie",null,null,"Soudeur assembleur industriel"]
["France","Grand Est","Haut-Rhin","Colmar",null,"Bâtiment",null,null,"Peintre en bâtiment"]
["France","Grand Est","Haut-Rhin","Colmar",null,"Travaux publics",null,null,"Maçon en voirie et réseaux divers"]
["France","Grand Est","Haut-Rhin","Colmar",null,"Bâtiment",null,null,"Couvreur-zingueur"]
["France","Grand Est","Haut-Rhin","Colmar",null,"Bâtiment",null,null,"Technicien d'études en construction bois"]
["France","Grand Est","Haut-Rhin","Colmar",null,"Bâtiment",null,null,"Technicien supérieur d'études en génie climatique"]
["France","Grand Est","Haut-Rhin","Colmar",null,"Fonctions supports de l'entreprise",null,null,"Gestionnaire comptable et fiscal"]
["France","Grand Est","Haut-Rhin","Colmar",null,"Industrie",null,null,"Tuyauteur industriel"]
["France","Grand Est","Haut-Rhin","Colmar",null,"Hôtellerie - restauration - tourisme - loisirs",null,null,"Agent(e) de restauration"]
["France","Grand Est","Haut-Rhin","Colmar",null,"Bâtiment",null,null,"Maçon"]
["France","Grand Est","Haut-Rhin","Colmar",null,"Bâtiment",null,null,"Technicien supérieur du bâtiment option économie de la construction"]
["France","Grand Est","Haut-Rhin","Colmar",null,"Bâtiment",null,null,"Conducteur de travaux aménagement finitions"]
["France","Grand Est","Haut-Rhin","Colmar",null,"Bâtiment",null,null,"Menuisier agenceur"]
["France","Grand Est","Haut-Rhin","Colmar",null,"Bâtiment",null,null,"Plaquiste-plâtrier"]
["France","Grand Est","Haut-Rhin","Colmar",null,"Hôtellerie - restauration - tourisme - loisirs",null,null,"Cuisinier"]
["France","Grand Est","Haut-Rhin","Colmar",null,"Bâtiment",null,null,"Agent de maintenance des bâtiments"]
["France","Grand Est","Haut-Rhin","Colmar",null,"Hôtellerie - restauration - tourisme - loisirs",null,null,"Réceptionniste en hôtellerie"]
["France","Grand Est","Haut-Rhin","Colmar",null,"Insertion et de la médiation",null,null,"Conseiller en insertion professionnelle"]
["France","Grand Est","Haut-Rhin","Colmar",null,"Bâtiment",null,null,"Electricien d'équipement du bâtiment"]
["France","Grand Est","Haut-Rhin","Colmar",null,"Bâtiment",null,null,"Technicien de maintenance d'équipements de confort climatique"]
["France","Grand Est","Haut-Rhin","Colmar",null,"Bâtiment",null,null,"Technicien d’études en agencement intérieur"]
["France","Grand Est","Haut-Rhin","Colmar",null,"Fonctions supports de l'entreprise",null,null,"Gestionnaire de paie"]
["France","Grand Est","Haut-Rhin","Colmar",null,"Bâtiment",null,null,"Métallier"]
["France","Grand Est","Haut-Rhin","Colmar",null,"Bâtiment",null,null,"Charpentier bois"]
["France","Grand Est","Haut-Rhin","Colmar",null,"Bâtiment",null,null,"Technicien d'études du bâtiment en dessin de projet"]
["France","Grand Est","Haut-Rhin","Colmar",null,"Fonctions supports de l'entreprise",null,null,"Employé administratif et d’accueil"]
["France","Grand Est","Haut-Rhin","Colmar",null,"Bâtiment",null,null,"Technicien d'installation en équipements de confort climatique"]
["France","Grand Est","Haut-Rhin","Colmar",null,"Bâtiment",null,null,"Conducteur de travaux du bâtiment et du génie civil"]
["France","Grand Est","Haut-Rhin","Colmar",null,"Bâtiment",null,null,"Technicien supérieur d'études en optimisation énergétique du bâtiment"]
["France","Grand Est","Haut-Rhin","Colmar",null,"Bâtiment",null,null,"Menuisier poseur-installateur"]
["France","Grand Est","Haut-Rhin","Colmar",null,"Hôtellerie - restauration - tourisme - loisirs",null,null,"Chargé d’accueil touristique et de loisirs"]
["France","Grand Est","Haut-Rhin","Colmar",null,"Bâtiment",null,null,"Technicien supérieur du bâtiment option étude de prix"]
["France","Grand Est","Haut-Rhin","Colmar",null,"Bâtiment",null,null,"Technicien métreur du bâtiment"]
["France","Grand Est","Haut-Rhin","Colmar",null,"Bâtiment",null,null,"Carreleur-chapiste"]
["France","Grand Est","Vosges","Epinal Golbey",null,"Travaux publics",null,null,"Maçon en voirie et réseaux divers"]
["France","Grand Est","Vosges","Epinal Golbey",null,"Bâtiment",null,null,"Couvreur-zingueur"]
["France","Grand Est","Vosges","Epinal Golbey",null,"Bâtiment",null,null,"Installateur en thermique et sanitaire"]
["France","Grand Est","Vosges","Epinal Golbey",null,"Hôtellerie - restauration - tourisme - loisirs",null,null,"Agent(e) de restauration"]
["France","Grand Est","Vosges","Epinal Golbey",null,"Hôtellerie - restauration - tourisme - loisirs",null,null,"Serveur en restauration"]
["France","Grand Est","Vosges","Epinal Golbey",null,"Bâtiment",null,null,"Plaquiste-plâtrier"]
["France","Grand Est","Vosges","Epinal Golbey",null,"Bâtiment",null,null,"Monteur de réseaux électriques aéro-souterrains"]
["France","Grand Est","Vosges","Epinal Golbey",null,"Travaux publics",null,null,"Monteur de réseaux électriques aéro-souterrains"]
["France","Grand Est","Vosges","Epinal Golbey",null,"Hôtellerie - restauration - tourisme - loisirs",null,null,"Cuisinier"]
["France","Grand Est","Vosges","Epinal Golbey",null,"Bâtiment",null,null,"Agent de maintenance des bâtiments"]
["France","Grand Est","Vosges","Epinal Golbey",null,"Hôtellerie - restauration - tourisme - loisirs",null,null,"Réceptionniste en hôtellerie"]
["France","Grand Est","Vosges","Epinal Golbey",null,"Bâtiment",null,null,"Façadier-peintre"]
["France","Grand Est","Vosges","Epinal Golbey",null,"Bâtiment",null,null,"Electricien d'équipement du bâtiment"]
["France","Grand Est","Vosges","Epinal Golbey",null,"Réseaux - Télécommunications - Informatique - Numérique",null,null,"Technicien de réseaux de télécommunications"]
["France","Grand Est","Vosges","Epinal Golbey",null,"Bâtiment",null,null,"Métallier"]
["France","Grand Est","Vosges","Epinal Golbey",null,"Services aux entreprises et à la personne",null,null,"Agent de sûreté et de sécurité privée"]
["France","Grand Est","Moselle","Metz",null,"Bâtiment",null,null,"Monteur dépanneur frigoriste"]
["France","Grand Est","Moselle","Metz",null,"Fonctions supports de l'entreprise",null,null,"Secrétaire assistant médico-social"]
["France","Grand Est","Moselle","Metz",null,"Fonctions supports de l'entreprise",null,null,"Gestionnaire comptable et fiscal"]
["France","Grand Est","Moselle","Metz",null,"Bâtiment",null,null,"Technicien d'intervention en froid commercial et climatisation"]
["France","Grand Est","Moselle","Metz",null,"Bâtiment",null,null,"Installateur en thermique et sanitaire"]
["France","Grand Est","Moselle","Metz",null,"Bâtiment",null,null,"Maçon"]
["France","Grand Est","Moselle","Metz",null,"Industrie",null,null,"Technicien(ne) supérieur(e) en automatique et informatique industrielle"]
["France","Grand Est","Moselle","Metz",null,"Commerce - vente - distribution",null,null,"Négociateur technico-commercial"]
["France","Grand Est","Moselle","Metz",null,"Fonctions supports de l'entreprise",null,null,"Formateur professionnel d'adultes"]
["France","Grand Est","Moselle","Metz",null,"Bâtiment",null,null,"Agent de maintenance des bâtiments"]
["France","Grand Est","Moselle","Metz",null,"Fonctions supports de l'entreprise",null,null,"Secrétaire assistant"]
["France","Grand Est","Moselle","Metz",null,"Bâtiment",null,null,"Façadier-peintre"]
["France","Grand Est","Moselle","Metz",null,"Fonctions supports de l'entreprise",null,null,"Comptable assistant"]
["France","Grand Est","Moselle","Metz",null,"Services aux entreprises et à la personne",null,null,"Assistant de vie aux familles"]
["France","Grand Est","Moselle","Metz",null,"Services aux entreprises et à la personne",null,null,"Agent de propreté et d'hygiène"]
["France","Grand Est","Moselle","Metz",null,"Fonctions supports de l'entreprise",null,null,"Secrétaire comptable"]
["France","Grand Est","Moselle","Metz",null,"Insertion et de la médiation",null,null,"Conseiller en insertion professionnelle"]
["France","Grand Est","Moselle","Metz",null,"Industrie",null,null,"Technicien de maintenance industrielle"]
["France","Grand Est","Moselle","Metz",null,"Bâtiment",null,null,"Electricien d'équipement du bâtiment"]
["France","Grand Est","Moselle","Metz",null,"Bâtiment",null,null,"Technicien du bâtiment communicant et connecté"]
["France","Grand Est","Moselle","Metz",null,"Bâtiment",null,null,"Technicien de maintenance d'équipements de confort climatique"]
["France","Grand Est","Moselle","Metz",null,"Fonctions supports de l'entreprise",null,null,"Gestionnaire de paie"]
["France","Grand Est","Moselle","Metz",null,"Fonctions supports de l'entreprise",null,null,"Assistant ressources humaines"]
["France","Grand Est","Moselle","Metz",null,"Bâtiment",null,null,"Technicien d'études du bâtiment en dessin de projet"]
["France","Grand Est","Moselle","Metz",null,"Fonctions supports de l'entreprise",null,null,"Employé administratif et d’accueil"]
["France","Grand Est","Moselle","Metz",null,"Bâtiment",null,null,"Technicien d'installation en équipements de confort climatique"]
["France","Grand Est","Moselle","Metz",null,"Bâtiment",null,null,"Coffreur Bancheur"]
["France","Grand Est","Moselle","Metz",null,"Bâtiment",null,null,"Technicien métreur du bâtiment"]
["France","Grand Est","Moselle","Metz",null,"Services aux entreprises et à la personne",null,null,"Agent de service médico-social"]
["France","Grand Est","Haut-Rhin","Mulhouse",null,"Industrie",null,null,"Conducteur d'appareils de l'industrie de la chimie"]
["France","Grand Est","Haut-Rhin","Mulhouse",null,"Fonctions supports de l'entreprise",null,null,"Secrétaire assistant médico-social"]
["France","Grand Est","Haut-Rhin","Mulhouse",null,"Bâtiment",null,null,"Peintre en bâtiment"]
["France","Grand Est","Haut-Rhin","Mulhouse",null,"Fonctions supports de l'entreprise",null,null,"Gestionnaire comptable et fiscal"]
["France","Grand Est","Haut-Rhin","Mulhouse",null,"Industrie",null,null,"Technicien de fabrication de l'industrie de la chimie"]
["France","Grand Est","Haut-Rhin","Mulhouse",null,"Bâtiment",null,null,"Installateur en thermique et sanitaire"]
["France","Grand Est","Haut-Rhin","Mulhouse",null,"Industrie",null,null,"Monteur qualifié d'équipements industriels"]
["France","Grand Est","Haut-Rhin","Mulhouse",null,"Industrie",null,null,"Technicien en usinage assisté par ordinateur"]
["France","Grand Est","Haut-Rhin","Mulhouse",null,"Industrie",null,null,"Conducteur d'installation et de machines automatisées"]
["France","Grand Est","Haut-Rhin","Mulhouse",null,"Industrie",null,null,"Technicien de production industrielle"]
["France","Grand Est","Haut-Rhin","Mulhouse",null,"Transports - logistique",null,null,"Conducteur livreur sur véhicule utilitaire léger"]
["France","Grand Est","Haut-Rhin","Mulhouse",null,"Hôtellerie - restauration - tourisme - loisirs",null,null,"Serveur en restauration"]
["France","Grand Est","Haut-Rhin","Mulhouse",null,"Bâtiment",null,null,"Plaquiste-plâtrier"]
["France","Grand Est","Haut-Rhin","Mulhouse",null,"Commerce - vente - distribution",null,null,"Négociateur technico-commercial"]
["France","Grand Est","Haut-Rhin","Mulhouse",null,"Fonctions supports de l'entreprise",null,null,"Formateur professionnel d'adultes"]
["France","Grand Est","Haut-Rhin","Mulhouse",null,"Industrie",null,null,"Agent de fabrication industrielle"]
["France","Grand Est","Haut-Rhin","Mulhouse",null,"Hôtellerie - restauration - tourisme - loisirs",null,null,"Cuisinier"]
["France","Grand Est","Haut-Rhin","Mulhouse",null,"Bâtiment",null,null,"Agent de maintenance des bâtiments"]
["France","Grand Est","Haut-Rhin","Mulhouse",null,"Fonctions supports de l'entreprise",null,null,"Secrétaire assistant"]
["France","Grand Est","Haut-Rhin","Mulhouse",null,"Bâtiment",null,null,"Façadier-peintre"]
["France","Grand Est","Haut-Rhin","Mulhouse",null,"Fonctions supports de l'entreprise",null,null,"Comptable assistant"]
["France","Grand Est","Haut-Rhin","Mulhouse",null,"Insertion et de la médiation",null,null,"Conseiller en insertion professionnelle"]
["France","Grand Est","Haut-Rhin","Mulhouse",null,"Bâtiment",null,null,"Electricien d'équipement du bâtiment"]
["France","Grand Est","Haut-Rhin","Mulhouse",null,"Industrie",null,null,"Opérateur régleur en usinage assisté par ordinateur"]
["France","Grand Est","Haut-Rhin","Mulhouse",null,"Fonctions supports de l'entreprise",null,null,"Assistant ressources humaines"]
["France","Grand Est","Haut-Rhin","Mulhouse",null,"Fonctions supports de l'entreprise",null,null,"Employé administratif et d’accueil"]
["France","Grand Est","Haut-Rhin","Mulhouse",null,"Industrie",null,null,"Soudeur assembleur industriel"]
["France","Grand Est","Haut-Rhin","Mulhouse",null,"Services aux entreprises et à la personne",null,null,"Agent de service médico-social"]
["France","Grand Est","Haut-Rhin","Mulhouse",null,"Industrie",null,null,"Technicien supérieur en fabrication additive"]
["France","Grand Est","Meurthe-et-Moselle","Nancy Laxou",null,"Fonctions supports de l'entreprise",null,null,"Secrétaire assistant médico-social"]
["France","Grand Est","Meurthe-et-Moselle","Nancy Laxou",null,"Bâtiment",null,null,"Peintre en bâtiment"]
["France","Grand Est","Meurthe-et-Moselle","Nancy Laxou",null,"Commerce - vente - distribution",null,null,"Conseiller commercial"]
["France","Grand Est","Meurthe-et-Moselle","Nancy Laxou",null,"Commerce - vente - distribution",null,null,"Manager d’unité marchande"]
["France","Grand Est","Meurthe-et-Moselle","Nancy Laxou",null,"Fonctions supports de l'entreprise",null,null,"Gestionnaire comptable et fiscal"]
["France","Grand Est","Meurthe-et-Moselle","Nancy Laxou",null,"Bâtiment",null,null,"Maçon"]
["France","Grand Est","Meurthe-et-Moselle","Nancy Laxou",null,"Bâtiment",null,null,"Plaquiste-plâtrier"]
["France","Grand Est","Meurthe-et-Moselle","Nancy Laxou",null,"Commerce - vente - distribution",null,null,"Négociateur technico-commercial"]
["France","Grand Est","Meurthe-et-Moselle","Nancy Laxou",null,"Fonctions supports de l'entreprise",null,null,"Formateur professionnel d'adultes"]
["France","Grand Est","Meurthe-et-Moselle","Nancy Laxou",null,"Bâtiment",null,null,"Agent de maintenance des bâtiments"]
["France","Grand Est","Meurthe-et-Moselle","Nancy Laxou",null,"Fonctions supports de l'entreprise",null,null,"Secrétaire assistant"]
["France","Grand Est","Meurthe-et-Moselle","Nancy Laxou",null,"Bâtiment",null,null,"Façadier-peintre"]
["France","Grand Est","Meurthe-et-Moselle","Nancy Laxou",null,"Fonctions supports de l'entreprise",null,null,"Comptable assistant"]
["France","Grand Est","Meurthe-et-Moselle","Nancy Laxou",null,"Services aux entreprises et à la personne",null,null,"Assistant de vie aux familles"]
["France","Grand Est","Meurthe-et-Moselle","Nancy Laxou",null,"Insertion et de la médiation",null,null,"Conseiller en insertion professionnelle"]
["France","Grand Est","Meurthe-et-Moselle","Nancy Laxou",null,"Insertion et de la médiation",null,null,"Encadrant technique d'insertion"]
["France","Grand Est","Meurthe-et-Moselle","Nancy Laxou",null,"Fonctions supports de l'entreprise",null,null,"Gestionnaire de paie"]
["France","Grand Est","Meurthe-et-Moselle","Nancy Laxou",null,"Fonctions supports de l'entreprise",null,null,"Assistant ressources humaines"]
["France","Grand Est","Meurthe-et-Moselle","Nancy Laxou",null,"Fonctions supports de l'entreprise",null,null,"Employé administratif et d’accueil"]
["France","Grand Est","Meurthe-et-Moselle","Nancy Laxou",null,"Bâtiment",null,null,"Peintre Décorateur"]
["France","Grand Est","Meurthe-et-Moselle","Nancy Laxou",null,"Bâtiment",null,null,"Menuisier poseur-installateur"]
["France","Grand Est","Meurthe-et-Moselle","Nancy Laxou",null,"Services aux entreprises et à la personne",null,null,"Agent de service médico-social"]
["France","Grand Est","Meurthe-et-Moselle","Pompey",null,"Bâtiment",null,null,"Technicien de bureau d'études en électricité des bâtiments"]
["France","Grand Est","Meurthe-et-Moselle","Pompey",null,"Industrie",null,null,"Technicien d’après-vente en électroménager et audiovisuel à domicile"]
["France","Grand Est","Meurthe-et-Moselle","Pompey",null,"Industrie",null,null,"Electricien d’installation et de maintenance des systèmes automatisés"]
["France","Grand Est","Meurthe-et-Moselle","Pompey",null,"Bâtiment",null,null,"Technicien d’équipement et d’exploitation en électricité"]
["France","Grand Est","Meurthe-et-Moselle","Pompey",null,"Réseaux - Télécommunications - Informatique - Numérique",null,null,"Installateur dépanneur en informatique"]
["France","Grand Est","Meurthe-et-Moselle","Pompey",null,"Bâtiment",null,null,"Electricien d'équipement du bâtiment"]
["France","Grand Est","Meurthe-et-Moselle","Pompey",null,"Réseaux - Télécommunications - Informatique - Numérique",null,null,"Technicien d'assistance en informatique"]
["France","Grand Est","Meurthe-et-Moselle","Pompey",null,"Réseaux - Télécommunications - Informatique - Numérique",null,null,"Développeur web et web mobile"]
["France","Grand Est","Meurthe-et-Moselle","Pompey",null,"Réseaux - Télécommunications - Informatique - Numérique",null,null,"Concepteur développeur d’applications"]
["France","Grand Est","Meurthe-et-Moselle","Pompey",null,"Réseaux - Télécommunications - Informatique - Numérique",null,null,"Technicien supérieur systèmes et réseaux"]
["France","Grand Est","Meurthe-et-Moselle","Pompey",null,"Réseaux - Télécommunications - Informatique - Numérique",null,null,"Administrateur d’infrastructures sécurisées"]
["France","Grand Est","Marne","Reims",null,"Fonctions supports de l'entreprise",null,null,"Secrétaire assistant médico-social"]
["France","Grand Est","Marne","Reims",null,"Commerce - vente - distribution",null,null,"Assistant manager d’unité marchande"]
["France","Grand Est","Marne","Reims",null,"Fonctions supports de l'entreprise",null,null,"Gestionnaire comptable et fiscal"]
["France","Grand Est","Marne","Reims",null,"Industrie",null,null,"Tuyauteur industriel"]
["France","Grand Est","Marne","Reims",null,"Commerce - vente - distribution",null,null,"Employé commercial en magasin"]
["France","Grand Est","Marne","Reims",null,"Bâtiment",null,null,"Maçon"]
["France","Grand Est","Marne","Reims",null,"Industrie",null,null,"Monteur en calorifuge industriel"]
["France","Grand Est","Marne","Reims",null,"Commerce - vente - distribution",null,null,"Négociateur technico-commercial"]
["France","Grand Est","Marne","Reims",null,"Fonctions supports de l'entreprise",null,null,"Formateur professionnel d'adultes"]
["France","Grand Est","Marne","Reims",null,"Fonctions supports de l'entreprise",null,null,"Secrétaire assistant"]
["France","Grand Est","Marne","Reims",null,"Fonctions supports de l'entreprise",null,null,"Comptable assistant"]
["France","Grand Est","Marne","Reims",null,"Services aux entreprises et à la personne",null,null,"Assistant de vie aux familles"]
["France","Grand Est","Marne","Reims",null,"Insertion et de la médiation",null,null,"Conseiller en insertion professionnelle"]
["France","Grand Est","Marne","Reims",null,"Insertion et de la médiation",null,null,"Encadrant technique d'insertion"]
["France","Grand Est","Marne","Reims",null,"Commerce - vente - distribution",null,null,"Vendeur-conseil en magasin"]
["France","Grand Est","Marne","Reims",null,"Fonctions supports de l'entreprise",null,null,"Gestionnaire de paie"]
["France","Grand Est","Marne","Reims",null,"Bâtiment",null,null,"Maçon du bâti ancien"]
["France","Grand Est","Marne","Reims",null,"Fonctions supports de l'entreprise",null,null,"Assistant ressources humaines"]
["France","Grand Est","Marne","Reims",null,"Industrie",null,null,"Soudeur TIG électrode enrobée"]
["France","Grand Est","Marne","Reims",null,"Fonctions supports de l'entreprise",null,null,"Employé administratif et d’accueil"]
["France","Grand Est","Marne","Reims",null,"Services aux entreprises et à la personne",null,null,"Agent de service médico-social"]
["France","Grand Est","Marne","Reims",null,"Bâtiment",null,null,"Carreleur-chapiste"]
["France","Grand Est","Vosges","Remiremont",null,"Fonctions supports de l'entreprise",null,null,"Secrétaire assistant médico-social"]
["France","Grand Est","Vosges","Remiremont",null,"Bâtiment",null,null,"Couvreur-zingueur"]
["France","Grand Est","Vosges","Remiremont",null,"Industrie",null,null,"Technicien d’après-vente en électroménager et audiovisuel à domicile"]
["France","Grand Est","Vosges","Remiremont",null,"Hôtellerie - restauration - tourisme - loisirs",null,null,"Agent(e) de restauration"]
["France","Grand Est","Vosges","Remiremont",null,"Commerce - vente - distribution",null,null,"Employé commercial en magasin"]
["France","Grand Est","Vosges","Remiremont",null,"Bâtiment",null,null,"Menuisier agenceur"]
["France","Grand Est","Vosges","Remiremont",null,"Réseaux - Télécommunications - Informatique - Numérique",null,null,"Installateur dépanneur en informatique"]
["France","Grand Est","Vosges","Remiremont",null,"Fonctions supports de l'entreprise",null,null,"Formateur professionnel d'adultes"]
["France","Grand Est","Vosges","Remiremont",null,"Bâtiment",null,null,"Agent de maintenance des bâtiments"]
["France","Grand Est","Vosges","Remiremont",null,"Fonctions supports de l'entreprise",null,null,"Secrétaire assistant"]
["France","Grand Est","Vosges","Remiremont",null,"Fonctions supports de l'entreprise",null,null,"Comptable assistant"]
["France","Grand Est","Vosges","Remiremont",null,"Insertion et de la médiation",null,null,"Conseiller en insertion professionnelle"]
["France","Grand Est","Vosges","Remiremont",null,"Réseaux - Télécommunications - Informatique - Numérique",null,null,"Technicien d'assistance en informatique"]
["France","Grand Est","Vosges","Remiremont",null,"Réseaux - Télécommunications - Informatique - Numérique",null,null,"Technicien réseaux IP"]
["France","Grand Est","Vosges","Remiremont",null,"Fonctions supports de l'entreprise",null,null,"Gestionnaire de paie"]
["France","Grand Est","Vosges","Remiremont",null,"Fonctions supports de l'entreprise",null,null,"Assistant ressources humaines"]
["France","Grand Est","Vosges","Remiremont",null,"Bâtiment",null,null,"Charpentier bois"]
["France","Grand Est","Vosges","Remiremont",null,"Bâtiment",null,null,"Constructeur bois"]
["France","Grand Est","Vosges","Remiremont",null,"Fonctions supports de l'entreprise",null,null,"Employé administratif et d’accueil"]
["France","Grand Est","Vosges","Remiremont",null,"Services aux entreprises et à la personne",null,null,"Agent de service médico-social"]
["France","Grand Est","Ardennes","Rethel Acy Romance",null,"Transports - logistique",null,null,"Conducteur du transport routier de marchandises sur tous véhicules"]
["France","Grand Est","Ardennes","Rethel Acy Romance",null,"Transports - logistique",null,null,"Conducteur du transport routier de marchandises sur porteur"]
["France","Grand Est","Ardennes","Rethel Acy Romance",null,"Transports - logistique",null,null,"Conducteur de transport en commun sur route"]
["France","Grand Est","Ardennes","Rethel Acy Romance",null,"Transports - logistique",null,null,"Agent magasinier"]
["France","Grand Est","Moselle","Saint Avold",null,"Bâtiment",null,null,"Maçon en voirie et réseaux divers"]
["France","Grand Est","Moselle","Saint Avold",null,"Industrie",null,null,"Technicien d’études en chaudronnerie, tuyauterie, structures métalliques"]
["France","Grand Est","Moselle","Saint Avold",null,"Industrie",null,null,"Tuyauteur industriel"]
["France","Grand Est","Moselle","Saint Avold",null,"Industrie",null,null,"Conducteur d'installation et de machines automatisées"]
["France","Grand Est","Moselle","Saint Avold",null,"Bâtiment",null,null,"Technicien d’équipement et d’exploitation en électricité"]
["France","Grand Est","Moselle","Saint Avold",null,"Commerce - vente - distribution",null,null,"Négociateur technico-commercial"]
["France","Grand Est","Moselle","Saint Avold",null,"Industrie",null,null,"Agent de fabrication industrielle"]
["France","Grand Est","Moselle","Saint Avold",null,"Services aux entreprises et à la personne",null,null,"Assistant de vie aux familles"]
["France","Grand Est","Moselle","Saint Avold",null,"Services aux entreprises et à la personne",null,null,"Agent de propreté et d'hygiène"]
["France","Grand Est","Moselle","Saint Avold",null,"Insertion et de la médiation",null,null,"Conseiller en insertion professionnelle"]
["France","Grand Est","Moselle","Saint Avold",null,"Insertion et de la médiation",null,null,"Encadrant technique d'insertion"]
["France","Grand Est","Moselle","Saint Avold",null,"Travaux publics",null,null,"Canalisateur"]
["France","Grand Est","Moselle","Saint Avold",null,"Services aux entreprises et à la personne",null,null,"Ouvrier du paysage"]
["France","Grand Est","Moselle","Saint Avold",null,"Bâtiment",null,null,"Electricien d'équipement du bâtiment"]
["France","Grand Est","Moselle","Saint Avold",null,"Fonctions supports de l'entreprise",null,null,"Gestionnaire de paie"]
["France","Grand Est","Moselle","Saint Avold",null,"Industrie",null,null,"Soudeur TIG électrode enrobée"]
["France","Grand Est","Moselle","Saint Avold",null,"Industrie",null,null,"Technicien en chaudronnerie"]
["France","Grand Est","Moselle","Saint Avold",null,"Industrie",null,null,"Technicien(ne) supérieur(e) en production industrielle"]
["France","Grand Est","Moselle","Saint Avold",null,"Industrie",null,null,"Soudeur assembleur industriel"]
["France","Grand Est","Moselle","Saint Avold",null,"Services aux entreprises et à la personne",null,null,"Agent de service médico-social"]
["France","Grand Est","Haute-Marne","Saint Dizier",null,"Bâtiment",null,null,"Monteur dépanneur frigoriste"]
["France","Grand Est","Haute-Marne","Saint Dizier",null,"Bâtiment",null,null,"Peintre en bâtiment"]
["France","Grand Est","Haute-Marne","Saint Dizier",null,"Bâtiment",null,null,"Installateur en thermique et sanitaire"]
["France","Grand Est","Haute-Marne","Saint Dizier",null,"Bâtiment",null,null,"Maçon"]
["France","Grand Est","Haute-Marne","Saint Dizier",null,"Industrie",null,null,"Mécanicien(ne) de maintenance automobile"]
["France","Grand Est","Haute-Marne","Saint Dizier",null,"Industrie",null,null,"Technicien de production industrielle"]
["France","Grand Est","Haute-Marne","Saint Dizier",null,"Bâtiment",null,null,"Plaquiste-plâtrier"]
["France","Grand Est","Haute-Marne","Saint Dizier",null,"Bâtiment",null,null,"Agent de maintenance des bâtiments"]
["France","Grand Est","Haute-Marne","Saint Dizier",null,"Bâtiment",null,null,"Façadier-peintre"]
["France","Grand Est","Haute-Marne","Saint Dizier",null,"Insertion et de la médiation",null,null,"Conseiller en insertion professionnelle"]
["France","Grand Est","Haute-Marne","Saint Dizier",null,"Bâtiment",null,null,"Electricien d'équipement du bâtiment"]
["France","Grand Est","Haute-Marne","Saint Dizier",null,"Fonctions supports de l'entreprise",null,null,"Gestionnaire de paie"]
["France","Grand Est","Haute-Marne","Saint Dizier",null,"Bâtiment",null,null,"Métallier"]
["France","Grand Est","Haute-Marne","Saint Dizier",null,"Fonctions supports de l'entreprise",null,null,"Assistant ressources humaines"]
["France","Grand Est","Haute-Marne","Saint Dizier",null,"Bâtiment",null,null,"Carreleur-chapiste"]
["France","Grand Est","Bas-Rhin","Strasbourg",null,"Bâtiment",null,null,"Monteur dépanneur frigoriste"]
["France","Grand Est","Bas-Rhin","Strasbourg",null,"Fonctions supports de l'entreprise",null,null,"Secrétaire assistant médico-social"]
["France","Grand Est","Bas-Rhin","Strasbourg",null,"Travaux publics",null,null,"Maçon en voirie et réseaux divers"]
["France","Grand Est","Bas-Rhin","Strasbourg",null,"Bâtiment",null,null,"Technicien d'intervention en froid commercial et climatisation"]
["France","Grand Est","Bas-Rhin","Strasbourg",null,"Bâtiment",null,null,"Installateur en thermique et sanitaire"]
["France","Grand Est","Bas-Rhin","Strasbourg",null,"Commerce - vente - distribution",null,null,"Employé commercial en magasin"]
["France","Grand Est","Bas-Rhin","Strasbourg",null,"Bâtiment",null,null,"Maçon"]
["France","Grand Est","Bas-Rhin","Strasbourg",null,"Bâtiment",null,null,"Technicien d’équipement et d’exploitation en électricité"]
["France","Grand Est","Bas-Rhin","Strasbourg",null,"Transports - logistique",null,null,"Conducteur livreur sur véhicule utilitaire léger"]
["France","Grand Est","Bas-Rhin","Strasbourg",null,"Commerce - vente - distribution",null,null,"Employé technicien-vendeur en matériel de sport"]
["France","Grand Est","Bas-Rhin","Strasbourg",null,"Bâtiment",null,null,"Plaquiste-plâtrier"]
["France","Grand Est","Bas-Rhin","Strasbourg",null,"Commerce - vente - distribution",null,null,"Négociateur technico-commercial"]
["France","Grand Est","Bas-Rhin","Strasbourg",null,"Fonctions supports de l'entreprise",null,null,"Formateur professionnel d'adultes"]
["France","Grand Est","Bas-Rhin","Strasbourg",null,"Bâtiment",null,null,"Agent de maintenance des bâtiments"]
["France","Grand Est","Bas-Rhin","Strasbourg",null,"Fonctions supports de l'entreprise",null,null,"Secrétaire assistant"]
["France","Grand Est","Bas-Rhin","Strasbourg",null,"Bâtiment",null,null,"Façadier-peintre"]
["France","Grand Est","Bas-Rhin","Strasbourg",null,"Fonctions supports de l'entreprise",null,null,"Comptable assistant"]
["France","Grand Est","Bas-Rhin","Strasbourg",null,"Insertion et de la médiation",null,null,"Conseiller en insertion professionnelle"]
["France","Grand Est","Bas-Rhin","Strasbourg",null,"Réseaux - Télécommunications - Informatique - Numérique",null,null,"Installateur de réseaux de télécommunications"]
["France","Grand Est","Bas-Rhin","Strasbourg",null,"Bâtiment",null,null,"Electricien d'équipement du bâtiment"]
["France","Grand Est","Bas-Rhin","Strasbourg",null,"Réseaux - Télécommunications - Informatique - Numérique",null,null,"Technicien d'assistance en informatique"]
["France","Grand Est","Bas-Rhin","Strasbourg",null,"Bâtiment",null,null,"Technicien de maintenance d'équipements de confort climatique"]
["France","Grand Est","Bas-Rhin","Strasbourg",null,"Fonctions supports de l'entreprise",null,null,"Gestionnaire de paie"]
["France","Grand Est","Bas-Rhin","Strasbourg",null,"Fonctions supports de l'entreprise",null,null,"Assistant ressources humaines"]
["France","Grand Est","Bas-Rhin","Strasbourg",null,"Fonctions supports de l'entreprise",null,null,"Employé administratif et d’accueil"]
["France","Grand Est","Bas-Rhin","Strasbourg",null,"Bâtiment",null,null,"Coffreur Bancheur"]
["France","Grand Est","Bas-Rhin","Strasbourg",null,"Réseaux - Télécommunications - Informatique - Numérique",null,null,"Technicien supérieur systèmes et réseaux"]
["France","Grand Est","Bas-Rhin","Strasbourg",null,"Services aux entreprises et à la personne",null,null,"Agent de sûreté et de sécurité privée"]
["France","Grand Est","Bas-Rhin","Strasbourg",null,"Services aux entreprises et à la personne",null,null,"Agent de service médico-social"]
["France","Grand Est","Moselle","Thionville Yutz",null,"Industrie",null,null,"Carrossier réparateur"]
["France","Grand Est","Moselle","Thionville Yutz",null,"Transports - logistique",null,null,"Technicien supérieur / Technicienne supérieure en méthodes et exploitation logistique"]
["France","Grand Est","Moselle","Thionville Yutz",null,"Industrie",null,null,"Mécanicien(ne) de maintenance automobile"]
["France","Grand Est","Moselle","Thionville Yutz",null,"Transports - logistique",null,null,"Conducteur livreur sur véhicule utilitaire léger"]
["France","Grand Est","Moselle","Thionville Yutz",null,"Commerce - vente - distribution",null,null,"Négociateur technico-commercial"]
["France","Grand Est","Moselle","Thionville Yutz",null,"Fonctions supports de l'entreprise",null,null,"Formateur professionnel d'adultes"]
["France","Grand Est","Moselle","Thionville Yutz",null,"Services aux entreprises et à la personne",null,null,"Agent de propreté et d'hygiène"]
["France","Grand Est","Moselle","Thionville Yutz",null,"Industrie",null,null,"Technicien(ne) électromécanicien(ne) automobile"]
["France","Grand Est","Moselle","Thionville Yutz",null,"Transports - logistique",null,null,"Technicien(ne) en logistique d'entreposage"]
["France","Grand Est","Moselle","Thionville Yutz",null,"Transports - logistique",null,null,"Préparateur de commandes en entrepôt"]
["France","Grand Est","Moselle","Thionville Yutz",null,"Transports - logistique",null,null,"Cariste d'entrepôt"]
["France","Grand Est","Moselle","Thionville Yutz",null,"Transports - logistique",null,null,"Agent magasinier"]
["France","Grand Est","Moselle","Thionville Yutz",null,"Industrie",null,null,"Contrôleur technique de véhicule léger"]
["France","Grand Est","Moselle","Thionville Yutz",null,"Services aux entreprises et à la personne",null,null,"Agent de sûreté et de sécurité privée"]
["France","Grand Est","Aube","Troyes Pont Ste Marie",null,"Transports - logistique",null,null,"Conducteur du transport routier de marchandises sur tous véhicules"]
["France","Grand Est","Aube","Troyes Pont Ste Marie",null,"Transports - logistique",null,null,"Conducteur du transport routier de marchandises sur porteur"]
["France","Grand Est","Aube","Troyes Pont Ste Marie",null,"Transports - logistique",null,null,"Conducteur de transport en commun sur route"]
["France","Grand Est","Aube","Troyes Pont Ste Marie",null,"Travaux publics",null,null,"Maçon en voirie et réseaux divers"]
["France","Grand Est","Aube","Troyes Pont Ste Marie",null,"Transports - logistique",null,null,"Conducteur livreur sur véhicule utilitaire léger"]
["France","Grand Est","Aube","Troyes Pont Ste Marie",null,"Bâtiment",null,null,"Plaquiste-plâtrier"]
["France","Grand Est","Aube","Troyes Pont Ste Marie",null,"Travaux publics",null,null,"Monteur de réseaux électriques aéro-souterrains"]
["France","Grand Est","Aube","Troyes Pont Ste Marie",null,"Bâtiment",null,null,"Agent de maintenance des bâtiments"]
["France","Grand Est","Aube","Troyes Pont Ste Marie",null,"Services aux entreprises et à la personne",null,null,"Assistant de vie aux familles"]
["France","Grand Est","Aube","Troyes Pont Ste Marie",null,"Insertion et de la médiation",null,null,"Conseiller en insertion professionnelle"]
["France","Grand Est","Aube","Troyes Pont Ste Marie",null,"Commerce - vente - distribution",null,null,"Conseiller relation client à distance"]
["France","Grand Est","Aube","Troyes Pont Ste Marie",null,"Fonctions supports de l'entreprise",null,null,"Assistant ressources humaines"]
["France","Grand Est","Aube","Troyes Pont Ste Marie",null,"Industrie",null,null,"Contrôleur technique de véhicule léger"]
["France","Grand Est","Aube","Troyes Pont Ste Marie",null,"Services aux entreprises et à la personne",null,null,"Agent de service médico-social"]
["France","Grand Est","Meuse","Verdun",null,"Industrie",null,null,"Mécanicien réparateur de motocycles"]
["France","Grand Est","Meuse","Verdun",null,"Bâtiment",null,null,"Peintre en bâtiment"]
["France","Grand Est","Meuse","Verdun",null,"Bâtiment",null,null,"Installateur en thermique et sanitaire"]
["France","Grand Est","Meuse","Verdun",null,"Commerce - vente - distribution",null,null,"Employé technicien-vendeur en matériel de sport"]
["France","Grand Est","Meuse","Verdun",null,"Commerce - vente - distribution",null,null,"Négociateur technico-commercial"]
["France","Grand Est","Meuse","Verdun",null,"Bâtiment",null,null,"Agent de maintenance des bâtiments"]
["France","Grand Est","Meuse","Verdun",null,"Services aux entreprises et à la personne",null,null,"Assistant de vie aux familles"]
["France","Grand Est","Meuse","Verdun",null,"Insertion et de la médiation",null,null,"Conseiller en insertion professionnelle"]
["France","Grand Est","Meuse","Verdun",null,"Insertion et de la médiation",null,null,"Encadrant technique d'insertion"]
["France","Grand Est","Meuse","Verdun",null,"Services aux entreprises et à la personne",null,null,"Ouvrier du paysage"]
["France","Grand Est","Meuse","Verdun",null,"Bâtiment",null,null,"Electricien d'équipement du bâtiment"]
["France","Grand Est","Meuse","Verdun",null,"Industrie",null,null,"Mécanicien réparateur de matériels agricoles et d'espaces verts option parcs et jardins"]
["France","Grand Est","Meuse","Verdun",null,"Industrie",null,null,"Soudeur TIG électrode enrobée"]
["France","Grand Est","Meuse","Verdun",null,"Fonctions supports de l'entreprise",null,null,"Employé administratif et d’accueil"]
["France","Grand Est","Meuse","Verdun",null,"Bâtiment",null,null,"Menuisier poseur-installateur"]
["France","Grand Est","Meuse","Verdun",null,"Industrie",null,null,"Soudeur assembleur industriel"]
["France","Ile-de-France","Val-D'Oise","Bernes sur Oise",null,"Transports - logistique",null,null,"Conducteur du transport routier de marchandises sur tous véhicules"]
["France","Ile-de-France","Val-D'Oise","Bernes sur Oise",null,"Transports - logistique",null,null,"Conducteur du transport routier de marchandises sur porteur"]
["France","Ile-de-France","Val-D'Oise","Bernes sur Oise",null,"Bâtiment",null,null,"Maçon en voirie et réseaux divers"]
["France","Ile-de-France","Val-D'Oise","Bernes sur Oise",null,"Travaux publics",null,null,"Maçon en voirie et réseaux divers"]
["France","Ile-de-France","Val-D'Oise","Bernes sur Oise",null,"Bâtiment",null,null,"Installateur en thermique et sanitaire"]
["France","Ile-de-France","Val-D'Oise","Bernes sur Oise",null,"Travaux publics",null,null,"Conducteur d’engins de chantiers urbains"]
["France","Ile-de-France","Val-D'Oise","Bernes sur Oise",null,"Bâtiment",null,null,"Monteur de réseaux électriques aéro-souterrains"]
["France","Ile-de-France","Val-D'Oise","Bernes sur Oise",null,"Travaux publics",null,null,"Monteur de réseaux électriques aéro-souterrains"]
["France","Ile-de-France","Val-D'Oise","Bernes sur Oise",null,"Bâtiment",null,null,"Agent de maintenance des bâtiments"]
["France","Ile-de-France","Val-D'Oise","Bernes sur Oise",null,"Travaux publics",null,null,"Canalisateur"]
["France","Ile-de-France","Val-D'Oise","Bernes sur Oise",null,"Bâtiment",null,null,"Electricien d'équipement du bâtiment"]
["France","Ile-de-France","Val-D'Oise","Bernes sur Oise",null,"Bâtiment",null,null,"Coffreur Bancheur"]
["France","Ile-de-France","Seine-et-Marne","Champs sur Marne",null,"Bâtiment",null,null,"Technicien de bureau d'études en électricité des bâtiments"]
["France","Ile-de-France","Seine-et-Marne","Champs sur Marne",null,"Transports - logistique",null,null,"Technicien supérieur / Technicienne supérieure en méthodes et exploitation logistique"]
["France","Ile-de-France","Seine-et-Marne","Champs sur Marne",null,"Hôtellerie - restauration - tourisme - loisirs",null,null,"Agent(e) de restauration"]
["France","Ile-de-France","Seine-et-Marne","Champs sur Marne",null,"Bâtiment",null,null,"Technicien supérieur géomètre topographe option cabinet de géomètre"]
["France","Ile-de-France","Seine-et-Marne","Champs sur Marne",null,"Réseaux - Télécommunications - Informatique - Numérique",null,null,"Installateur dépanneur en informatique"]
["France","Ile-de-France","Seine-et-Marne","Champs sur Marne",null,"Hôtellerie - restauration - tourisme - loisirs",null,null,"Serveur en restauration"]
["France","Ile-de-France","Seine-et-Marne","Champs sur Marne",null,"Bâtiment",null,null,"Dessinateur projeteur en béton armé"]
["France","Ile-de-France","Seine-et-Marne","Champs sur Marne",null,"Hôtellerie - restauration - tourisme - loisirs",null,null,"Cuisinier"]
["France","Ile-de-France","Seine-et-Marne","Champs sur Marne",null,"Bâtiment",null,null,"Agent de maintenance des bâtiments"]
["France","Ile-de-France","Seine-et-Marne","Champs sur Marne",null,"Services aux entreprises et à la personne",null,null,"Assistant de vie aux familles"]
["France","Ile-de-France","Seine-et-Marne","Champs sur Marne",null,"Réseaux - Télécommunications - Informatique - Numérique",null,null,"Installateur de réseaux de télécommunications"]
["France","Ile-de-France","Seine-et-Marne","Champs sur Marne",null,"Réseaux - Télécommunications - Informatique - Numérique",null,null,"Technicien de réseaux de télécommunications"]
["France","Ile-de-France","Seine-et-Marne","Champs sur Marne",null,"Transports - logistique",null,null,"Agent magasinier"]
["France","Ile-de-France","Seine-et-Marne","Champs sur Marne",null,"Réseaux - Télécommunications - Informatique - Numérique",null,null,"Technicien d'assistance en informatique"]
["France","Ile-de-France","Seine-et-Marne","Champs sur Marne",null,"Réseaux - Télécommunications - Informatique - Numérique",null,null,"Technicien réseaux IP"]
["France","Ile-de-France","Seine-et-Marne","Champs sur Marne",null,"Réseaux - Télécommunications - Informatique - Numérique",null,null,"Technicien supérieur systèmes et réseaux"]
["France","Ile-de-France","Seine-et-Marne","Champs sur Marne",null,"Bâtiment",null,null,"BIM modeleur du bâtiment"]
["France","Ile-de-France","Seine-et-Marne","Champs sur Marne",null,"Services aux entreprises et à la personne",null,null,"Agent de service médico-social"]
["France","Ile-de-France","Seine-et-Marne","Champs sur Marne",null,"Services aux entreprises et à la personne",null,null,"Responsable-coordonnateur services au domicile"]
["France","Ile-de-France","Val-de-Marne","Créteil",null,"Fonctions supports de l'entreprise",null,null,"Secrétaire assistant médico-social"]
["France","Ile-de-France","Val-de-Marne","Créteil",null,"Fonctions supports de l'entreprise",null,null,"Gestionnaire comptable et fiscal"]
["France","Ile-de-France","Val-de-Marne","Créteil",null,"Hôtellerie - restauration - tourisme - loisirs",null,null,"Employé d’étage en hôtellerie"]
["France","Ile-de-France","Val-de-Marne","Créteil",null,"Hôtellerie - restauration - tourisme - loisirs",null,null,"Gouvernant en hôtellerie"]
["France","Ile-de-France","Val-de-Marne","Créteil",null,"Hôtellerie - restauration - tourisme - loisirs",null,null,"Réceptionniste en hôtellerie"]
["France","Ile-de-France","Val-de-Marne","Créteil",null,"Services aux entreprises et à la personne",null,null,"Assistant de vie aux familles"]
["France","Ile-de-France","Val-de-Marne","Créteil",null,"Services aux entreprises et à la personne",null,null,"Agent de propreté et d'hygiène"]
["France","Ile-de-France","Val-de-Marne","Créteil",null,"Réseaux - Télécommunications - Informatique - Numérique",null,null,"Technicien d'assistance en informatique"]
["France","Ile-de-France","Val-de-Marne","Créteil",null,"Hôtellerie - restauration - tourisme - loisirs",null,null,"Conseiller vendeur en voyages"]
["France","Ile-de-France","Val-de-Marne","Créteil",null,"Fonctions supports de l'entreprise",null,null,"Gestionnaire de paie"]
["France","Ile-de-France","Val-de-Marne","Créteil",null,"Fonctions supports de l'entreprise",null,null,"Assistant de direction"]
["France","Ile-de-France","Val-de-Marne","Créteil",null,"Hôtellerie - restauration - tourisme - loisirs",null,null,"Chargé d’accueil touristique et de loisirs"]
["France","Ile-de-France","Val-de-Marne","Créteil",null,"Réseaux - Télécommunications - Informatique - Numérique",null,null,"Technicien supérieur systèmes et réseaux"]
["France","Ile-de-France","Val-de-Marne","Créteil",null,"Services aux entreprises et à la personne",null,null,"Agent de service médico-social"]
["France","Ile-de-France","Yvelines","Elancourt SQY",null,"Fonctions supports de l'entreprise",null,null,"Secrétaire assistant médico-social"]
["France","Ile-de-France","Yvelines","Elancourt SQY",null,"Fonctions supports de l'entreprise",null,null,"Formateur professionnel d'adultes"]
["France","Ile-de-France","Yvelines","Elancourt SQY",null,"Bâtiment",null,null,"Agent de maintenance des bâtiments"]
["France","Ile-de-France","Yvelines","Elancourt SQY",null,"Services aux entreprises et à la personne",null,null,"Assistant de vie aux familles"]
["France","Ile-de-France","Yvelines","Elancourt SQY",null,"Fonctions supports de l'entreprise",null,null,"Secrétaire comptable"]
["France","Ile-de-France","Yvelines","Elancourt SQY",null,"Insertion et de la médiation",null,null,"Conseiller en insertion professionnelle"]
["France","Ile-de-France","Yvelines","Elancourt SQY",null,"Fonctions supports de l'entreprise",null,null,"Gestionnaire de paie"]
["France","Ile-de-France","Yvelines","Elancourt SQY",null,"Fonctions supports de l'entreprise",null,null,"Assistant de direction"]
["France","Ile-de-France","Essonne","Evry Ris Orangis",null,"Travaux publics",null,null,"Maçon en voirie et réseaux divers"]
["France","Ile-de-France","Essonne","Evry Ris Orangis",null,"Transports - logistique",null,null,"Technicien supérieur / Technicienne supérieure en méthodes et exploitation logistique"]
["France","Ile-de-France","Essonne","Evry Ris Orangis",null,"Bâtiment",null,null,"Maçon"]
["France","Ile-de-France","Essonne","Evry Ris Orangis",null,"Bâtiment",null,null,"Assistant chef de chantier gros oeuvre"]
["France","Ile-de-France","Essonne","Evry Ris Orangis",null,"Transports - logistique",null,null,"Conducteur livreur sur véhicule utilitaire léger"]
["France","Ile-de-France","Essonne","Evry Ris Orangis",null,"Transports - logistique",null,null,"Technicien en logistique d'entreposage"]
["France","Ile-de-France","Essonne","Evry Ris Orangis",null,"Transports - logistique",null,null,"Préparateur de commandes en entrepôt"]
["France","Ile-de-France","Essonne","Evry Ris Orangis",null,"Transports - logistique",null,null,"Cariste d'entrepôt"]
["France","Ile-de-France","Essonne","Evry Ris Orangis",null,"Transports - logistique",null,null,"Agent magasinier"]
["France","Ile-de-France","Essonne","Evry Ris Orangis",null,"Bâtiment",null,null,"Chef de chantier gros oeuvre"]
["France","Ile-de-France","Essonne","Evry Ris Orangis",null,"Bâtiment",null,null,"Coffreur Bancheur"]
["France","Ile-de-France","Essonne","Evry Ris Orangis",null,"Bâtiment",null,null,"BIM modeleur du bâtiment"]
["France","Ile-de-France","Val-D'Oise","Gonesse",null,"Transports - logistique",null,null,"Technicien supérieur / Technicienne supérieure en méthodes et exploitation logistique"]
["France","Ile-de-France","Val-D'Oise","Gonesse",null,"Industrie",null,null,"Conducteur d'installation et de machines automatisées"]
["France","Ile-de-France","Val-D'Oise","Gonesse",null,"Industrie",null,null,"Electricien d’installation et de maintenance des systèmes automatisés"]
["France","Ile-de-France","Val-D'Oise","Gonesse",null,"Services aux entreprises et à la personne",null,null,"Agent de propreté et d'hygiène"]
["France","Ile-de-France","Val-D'Oise","Gonesse",null,"Transports - logistique",null,null,"Technicien en logistique d'entreposage"]
["France","Ile-de-France","Val-D'Oise","Gonesse",null,"Transports - logistique",null,null,"Préparateur de commandes en entrepôt"]
["France","Ile-de-France","Val-D'Oise","Gonesse",null,"Transports - logistique",null,null,"Cariste d'entrepôt"]
["France","Ile-de-France","Val-D'Oise","Gonesse",null,"Transports - logistique",null,null,"Agent magasinier"]
["France","Ile-de-France","Essonne","Lardy",null,"Bâtiment",null,null,"Peintre en bâtiment"]
["France","Ile-de-France","Essonne","Lardy",null,"Bâtiment",null,null,"Technicien de bureau d'études en électricité des bâtiments"]
["France","Ile-de-France","Essonne","Lardy",null,"Bâtiment",null,null,"Couvreur-zingueur"]
["France","Ile-de-France","Essonne","Lardy",null,"Bâtiment",null,null,"Installateur en thermique et sanitaire"]
["France","Ile-de-France","Essonne","Lardy",null,"Bâtiment",null,null,"Technicien de maintenance CVC"]
["France","Ile-de-France","Essonne","Lardy",null,"Bâtiment",null,null,"Plaquiste-plâtrier"]
["France","Ile-de-France","Essonne","Lardy",null,"Bâtiment",null,null,"Agent de maintenance CVC"]
["France","Ile-de-France","Essonne","Lardy",null,"Services aux entreprises et à la personne",null,null,"Ouvrier du paysage"]
["France","Ile-de-France","Essonne","Lardy",null,"Bâtiment",null,null,"Electricien d'équipement du bâtiment"]
["France","Ile-de-France","Essonne","Lardy",null,"Bâtiment",null,null,"Agent de maintenance d'équipements de confort climatique"]
["France","Ile-de-France","Essonne","Lardy",null,"Bâtiment",null,null,"Technicien de maintenance d'équipements de confort climatique"]
["France","Ile-de-France","Essonne","Lardy",null,"Services aux entreprises et à la personne",null,null,"Ouvrier de production horticole"]
["France","Ile-de-France","Essonne","Lardy",null,"Bâtiment",null,null,"Chargé d'affaires en rénovation énergétique du bâtiment"]
["France","Ile-de-France","Essonne","Lardy",null,"Bâtiment",null,null,"Technicien d'installation en équipements de confort climatique"]
["France","Ile-de-France","Essonne","Lardy",null,"Bâtiment",null,null,"Menuisier poseur-installateur"]
["France","Ile-de-France","Essonne","Lardy",null,"Services aux entreprises et à la personne",null,null,"Ouvrier du génie écologique"]
["France","Ile-de-France","Yvelines","Mantes Magnanville",null,"Industrie",null,null,"Carrossier réparateur"]
["France","Ile-de-France","Yvelines","Mantes Magnanville",null,"Industrie",null,null,"Electricien d’installation et de maintenance des systèmes automatisés"]
["France","Ile-de-France","Yvelines","Mantes Magnanville",null,"Industrie",null,null,"Technicien(ne) supérieur(e) en automatique et informatique industrielle"]
["France","Ile-de-France","Yvelines","Mantes Magnanville",null,"Insertion et de la médiation",null,null,"Conseiller en insertion professionnelle"]
["France","Ile-de-France","Yvelines","Mantes Magnanville",null,"Industrie",null,null,"Technicien de maintenance industrielle"]
["France","Ile-de-France","Yvelines","Mantes Magnanville",null,"Transports - logistique",null,null,"Agent magasinier"]
["France","Ile-de-France","Yvelines","Mantes Magnanville",null,"Industrie",null,null,"Soudeur TIG électrode enrobée"]
["France","Ile-de-France","Yvelines","Mantes Magnanville",null,"Industrie",null,null,"Soudeur assembleur industriel"]
["France","Ile-de-France","Hauts-de-Seine","Meudon la Forêt",null,"Bâtiment",null,null,"Technicien de bureau d'études en électricité des bâtiments"]
["France","Ile-de-France","Hauts-de-Seine","Meudon la Forêt",null,"Bâtiment",null,null,"Technicien en systèmes de sûreté"]
["France","Ile-de-France","Hauts-de-Seine","Meudon la Forêt",null,"Industrie",null,null,"Electromécanicien de maintenance industrielle"]
["France","Ile-de-France","Hauts-de-Seine","Meudon la Forêt",null,"Bâtiment",null,null,"Technicien d’équipement et d’exploitation en électricité"]
["France","Ile-de-France","Hauts-de-Seine","Meudon la Forêt",null,"Industrie",null,null,"Technicien supérieur en conception industrielle de systèmes mécaniques"]
["France","Ile-de-France","Hauts-de-Seine","Meudon la Forêt",null,"Services aux entreprises et à la personne",null,null,"Technicien de maintenance et de travaux en systèmes de sécurité incendie"]
["France","Ile-de-France","Hauts-de-Seine","Meudon la Forêt",null,"Bâtiment",null,null,"Agent de maintenance des bâtiments"]
["France","Ile-de-France","Hauts-de-Seine","Meudon la Forêt",null,"Industrie",null,null,"Technicien de maintenance industrielle"]
["France","Ile-de-France","Hauts-de-Seine","Meudon la Forêt",null,"Bâtiment",null,null,"Electricien d'équipement du bâtiment"]
["France","Ile-de-France","Hauts-de-Seine","Meudon la Forêt",null,"Industrie",null,null,"Agent de fabrication et montage en chaudronnerie"]
["France","Ile-de-France","Hauts-de-Seine","Meudon la Forêt",null,"Industrie",null,null,"Technicien en chaudronnerie"]
["France","Ile-de-France","Paris","Paris Politzer",null,"Fonctions supports de l'entreprise",null,null,"Secrétaire assistant médico-social"]
["France","Ile-de-France","Paris","Paris Politzer",null,"Fonctions supports de l'entreprise",null,null,"Formateur professionnel d'adultes"]
["France","Ile-de-France","Paris","Paris Politzer",null,"Fonctions supports de l'entreprise",null,null,"Secrétaire assistant"]
["France","Ile-de-France","Paris","Paris Politzer",null,"Fonctions supports de l'entreprise",null,null,"Comptable assistant"]
["France","Ile-de-France","Paris","Paris Politzer",null,"Insertion et de la médiation",null,null,"Agent de médiation, information, services"]
["France","Ile-de-France","Paris","Paris Politzer",null,"Insertion et de la médiation",null,null,"Conseiller en insertion professionnelle"]
["France","Ile-de-France","Paris","Paris Politzer",null,"Transports - logistique",null,null,"Agent magasinier"]
["France","Ile-de-France","Paris","Paris Politzer",null,"Fonctions supports de l'entreprise",null,null,"Gestionnaire de paie"]
["France","Ile-de-France","Paris","Paris Politzer",null,"Fonctions supports de l'entreprise",null,null,"Assistant de direction"]
["France","Ile-de-France","Paris","Paris Politzer",null,"Fonctions supports de l'entreprise",null,null,"Employé administratif et d’accueil"]
["France","Ile-de-France","Val-D'Oise","Saint Ouen l'Aumône",null,"Industrie",null,null,"Mécanicien(ne) automobile"]
["France","Ile-de-France","Val-D'Oise","Saint Ouen l'Aumône",null,"Industrie",null,null,"Technicien d’après-vente en électroménager et audiovisuel à domicile"]
["France","Ile-de-France","Val-D'Oise","Saint Ouen l'Aumône",null,"Industrie",null,null,"Mécanicien(ne) de maintenance automobile"]
["France","Ile-de-France","Val-D'Oise","Saint Ouen l'Aumône",null,"Services aux entreprises et à la personne",null,null,"Assistant de vie aux familles"]
["France","Ile-de-France","Val-D'Oise","Saint Ouen l'Aumône",null,"Industrie",null,null,"Agent de montage et de câblage en électronique"]
["France","Ile-de-France","Val-D'Oise","Saint Ouen l'Aumône",null,"Industrie",null,null,"Technicien(ne) électromécanicien(ne) automobile"]
["France","Ile-de-France","Val-D'Oise","Saint Ouen l'Aumône",null,"Fonctions supports de l'entreprise",null,null,"Gestionnaire de paie"]
["France","Ile-de-France","Seine-Saint-Denis","Stains",null,"Bâtiment",null,null,"Monteur dépanneur frigoriste"]
["France","Ile-de-France","Seine-Saint-Denis","Stains",null,"Bâtiment",null,null,"Peintre en bâtiment"]
["France","Ile-de-France","Seine-Saint-Denis","Stains",null,"Bâtiment",null,null,"Technicien de bureau d'études en électricité des bâtiments"]
["France","Ile-de-France","Seine-Saint-Denis","Stains",null,"Bâtiment",null,null,"Technicien d'intervention en froid commercial et climatisation"]
["France","Ile-de-France","Seine-Saint-Denis","Stains",null,"Bâtiment",null,null,"Installateur en thermique et sanitaire"]
["France","Ile-de-France","Seine-Saint-Denis","Stains",null,"Hôtellerie - restauration - tourisme - loisirs",null,null,"Agent(e) de restauration"]
["France","Ile-de-France","Seine-Saint-Denis","Stains",null,"Industrie",null,null,"Electricien d’installation et de maintenance des systèmes automatisés"]
["France","Ile-de-France","Seine-Saint-Denis","Stains",null,"Hôtellerie - restauration - tourisme - loisirs",null,null,"Cuisinier"]
["France","Ile-de-France","Seine-Saint-Denis","Stains",null,"Bâtiment",null,null,"Agent de maintenance des bâtiments"]
["France","Ile-de-France","Seine-Saint-Denis","Stains",null,"Services aux entreprises et à la personne",null,null,"Assistant de vie aux familles"]
["France","Ile-de-France","Seine-Saint-Denis","Stains",null,"Bâtiment",null,null,"Electricien d'équipement du bâtiment"]
["France","Ile-de-France","Seine-Saint-Denis","Stains",null,"Transports - logistique",null,null,"Agent magasinier"]
["France","Ile-de-France","Seine-Saint-Denis","Stains",null,"Transports - logistique",null,null,"Organisateur de transports aériens ou maritimes de marchandises"]
["France","Ile-de-France","Hauts-de-Seine","Nanterre la défense",null,"Fonctions supports de l'entreprise",null,null,"Gestionnaire comptable et fiscal"]
["France","Ile-de-France","Hauts-de-Seine","Nanterre la défense",null,"Services aux entreprises et à la personne",null,null,"Assistant de vie aux familles"]
["France","Ile-de-France","Hauts-de-Seine","Nanterre la défense",null,"Insertion et de la médiation",null,null,"Conseiller en insertion professionnelle"]
["France","Ile-de-France","Hauts-de-Seine","Nanterre la défense",null,"Fonctions supports de l'entreprise",null,null,"Gestionnaire de paie"]
["France","Ile-de-France","Hauts-de-Seine","Nanterre la défense",null,"Fonctions supports de l'entreprise",null,null,"Assistant de direction"]
["France","Ile-de-France","Hauts-de-Seine","Nanterre la défense",null,"Fonctions supports de l'entreprise",null,null,"Employé administratif et d’accueil"]
["France","Ile-de-France","Hauts-de-Seine","Nanterre la défense",null,"Services aux entreprises et à la personne",null,null,"Agent de service médico-social"]
["France","Ile-de-France","Hauts-de-Seine","Nanterre la défense",null,"Services aux entreprises et à la personne",null,null,"Responsable-coordonnateur services au domicile"]
["France","Hauts-de-France","Somme","Amiens",null,"Bâtiment",null,null,"Monteur dépanneur frigoriste"]
["France","Hauts-de-France","Somme","Amiens",null,"Travaux publics",null,null,"Maçon en voirie et réseaux divers"]
["France","Hauts-de-France","Somme","Amiens",null,"Bâtiment",null,null,"Technicien d'intervention en froid commercial et climatisation"]
["France","Hauts-de-France","Somme","Amiens",null,"Bâtiment",null,null,"Installateur en thermique et sanitaire"]
["France","Hauts-de-France","Somme","Amiens",null,"Industrie",null,null,"Tuyauteur industriel"]
["France","Hauts-de-France","Somme","Amiens",null,"Industrie",null,null,"Technicien supérieur de maintenance industrielle"]
["France","Hauts-de-France","Somme","Amiens",null,"Industrie",null,null,"Technicien de maintenance industrielle"]
["France","Hauts-de-France","Somme","Amiens",null,"Insertion et de la médiation",null,null,"Encadrant technique d'insertion"]
["France","Hauts-de-France","Somme","Amiens",null,"Transports - logistique",null,null,"Préparateur de commandes en entrepôt"]
["France","Hauts-de-France","Somme","Amiens",null,"Insertion et de la médiation",null,null,"Médiateur social accès aux droits et services"]
["France","Hauts-de-France","Somme","Amiens",null,"Réseaux - Télécommunications - Informatique - Numérique",null,null,"Concepteur développeur d’applications"]
["France","Hauts-de-France","Somme","Amiens",null,"Commerce - vente - distribution",null,null,"Assistant commercial"]
["France","Hauts-de-France","Somme","Amiens",null,"Industrie",null,null,"Soudeur TIG électrode enrobée"]
["France","Hauts-de-France","Somme","Amiens",null,"Industrie",null,null,"Technicien en chaudronnerie"]
["France","Hauts-de-France","Somme","Amiens",null,"Bâtiment",null,null,"Chargé d'affaires en rénovation énergétique du bâtiment"]
["France","Hauts-de-France","Somme","Amiens",null,"Bâtiment",null,null,"Technicien d'installation en équipements de confort climatique"]
["France","Hauts-de-France","Somme","Amiens",null,"Réseaux - Télécommunications - Informatique - Numérique",null,null,"Technicien supérieur systèmes et réseaux"]
["France","Hauts-de-France","Somme","Amiens",null,"Réseaux - Télécommunications - Informatique - Numérique",null,null,"Administrateur d’infrastructures sécurisées"]
["France","Hauts-de-France","Somme","Amiens",null,"Industrie",null,null,"Soudeur assembleur industriel"]
["France","Hauts-de-France","Pas-de-Calais","Arras",null,"Fonctions supports de l'entreprise",null,null,"Secrétaire assistant médico-social"]
["France","Hauts-de-France","Pas-de-Calais","Arras",null,"Insertion et de la médiation",null,null,"Conseiller en insertion professionnelle"]
["France","Hauts-de-France","Pas-de-Calais","Arras",null,"Insertion et de la médiation",null,null,"Encadrant technique d'insertion"]
["France","Hauts-de-France","Pas-de-Calais","Arras",null,"Fonctions supports de l'entreprise",null,null,"Gestionnaire de paie"]
["France","Hauts-de-France","Pas-de-Calais","Arras",null,"Industrie",null,null,"Conducteur d'équipements agroalimentaires"]
["France","Hauts-de-France","Pas-de-Calais","Calais",null,"Fonctions supports de l'entreprise",null,null,"Secrétaire assistant médico-social"]
["France","Hauts-de-France","Pas-de-Calais","Calais",null,"Bâtiment",null,null,"Peintre en bâtiment"]
["France","Hauts-de-France","Pas-de-Calais","Calais",null,"Industrie",null,null,"Peintre en carrosserie"]
["France","Hauts-de-France","Pas-de-Calais","Calais",null,"Bâtiment",null,null,"Couvreur-zingueur"]
["France","Hauts-de-France","Pas-de-Calais","Calais",null,"Commerce - vente - distribution",null,null,"Employé commercial en magasin"]
["France","Hauts-de-France","Pas-de-Calais","Calais",null,"Bâtiment",null,null,"Agent de maintenance des bâtiments"]
["France","Hauts-de-France","Pas-de-Calais","Calais",null,"Services aux entreprises et à la personne",null,null,"Assistant de vie aux familles"]
["France","Hauts-de-France","Pas-de-Calais","Calais",null,"Insertion et de la médiation",null,null,"Conseiller en insertion professionnelle"]
["France","Hauts-de-France","Pas-de-Calais","Calais",null,"Insertion et de la médiation",null,null,"Encadrant technique d'insertion"]
["France","Hauts-de-France","Pas-de-Calais","Calais",null,"Bâtiment",null,null,"Electricien d'équipement du bâtiment"]
["France","Hauts-de-France","Pas-de-Calais","Calais",null,"Bâtiment",null,null,"Agent de maintenance d'équipements de confort climatique"]
["France","Hauts-de-France","Pas-de-Calais","Calais",null,"Bâtiment",null,null,"Technicien de maintenance d'équipements de confort climatique"]
["France","Hauts-de-France","Pas-de-Calais","Calais",null,"Commerce - vente - distribution",null,null,"Vendeur-conseil en magasin"]
["France","Hauts-de-France","Pas-de-Calais","Calais",null,"Fonctions supports de l'entreprise",null,null,"Assistant ressources humaines"]
["France","Hauts-de-France","Pas-de-Calais","Calais",null,"Fonctions supports de l'entreprise",null,null,"Assistant de direction"]
["France","Hauts-de-France","Pas-de-Calais","Calais",null,"Fonctions supports de l'entreprise",null,null,"Employé administratif et d’accueil"]
["France","Hauts-de-France","Pas-de-Calais","Calais",null,"Bâtiment",null,null,"Technicien d'installation en équipements de confort climatique"]
["France","Hauts-de-France","Pas-de-Calais","Calais",null,"Services aux entreprises et à la personne",null,null,"Agent de service médico-social"]
["France","Hauts-de-France","Nord","Cambrai",null,"Bâtiment",null,null,"Plaquiste-plâtrier"]
["France","Hauts-de-France","Nord","Cambrai",null,"Services aux entreprises et à la personne",null,null,"Assistant de vie aux familles"]
["France","Hauts-de-France","Nord","Cambrai",null,"Insertion et de la médiation",null,null,"Conseiller en insertion professionnelle"]
["France","Hauts-de-France","Nord","Cambrai",null,"Fonctions supports de l'entreprise",null,null,"Gestionnaire de paie"]
["France","Hauts-de-France","Nord","Cambrai",null,"Fonctions supports de l'entreprise",null,null,"Assistant ressources humaines"]
["France","Hauts-de-France","Oise","Compiègne",null,"Industrie",null,null,"Conducteur d'appareils de l'industrie de la chimie"]
["France","Hauts-de-France","Oise","Compiègne",null,"Industrie",null,null,"Technicien de fabrication de l'industrie de la chimie"]
["France","Hauts-de-France","Oise","Compiègne",null,"Bâtiment",null,null,"Technicien de maintenance CVC"]
["France","Hauts-de-France","Oise","Compiègne",null,"Bâtiment",null,null,"Agent de maintenance CVC"]
["France","Hauts-de-France","Oise","Compiègne",null,"Services aux entreprises et à la personne",null,null,"Assistant de vie aux familles"]
["France","Hauts-de-France","Oise","Compiègne",null,"Insertion et de la médiation",null,null,"Conseiller en insertion professionnelle"]
["France","Hauts-de-France","Oise","Compiègne",null,"Bâtiment",null,null,"Agent de maintenance d'équipements de confort climatique"]
["France","Hauts-de-France","Oise","Compiègne",null,"Bâtiment",null,null,"Technicien de maintenance d'équipements de confort climatique"]
["France","Hauts-de-France","Oise","Creil",null,"Transports - logistique",null,null,"Technicien supérieur / Technicienne supérieure en méthodes et exploitation logistique"]
["France","Hauts-de-France","Oise","Creil",null,"Hôtellerie - restauration - tourisme - loisirs",null,null,"Agent(e) de restauration"]
["France","Hauts-de-France","Oise","Creil",null,"Industrie",null,null,"Conducteur d'installation et de machines automatisées"]
["France","Hauts-de-France","Oise","Creil",null,"Industrie",null,null,"Technicien de production en plasturgie"]
["France","Hauts-de-France","Oise","Creil",null,"Bâtiment",null,null,"Maçon"]
["France","Hauts-de-France","Oise","Creil",null,"Hôtellerie - restauration - tourisme - loisirs",null,null,"Employé d’étage en hôtellerie"]
["France","Hauts-de-France","Oise","Creil",null,"Réseaux - Télécommunications - Informatique - Numérique",null,null,"Installateur dépanneur en informatique"]
["France","Hauts-de-France","Oise","Creil",null,"Hôtellerie - restauration - tourisme - loisirs",null,null,"Serveur en restauration"]
["France","Hauts-de-France","Oise","Creil",null,"Hôtellerie - restauration - tourisme - loisirs",null,null,"Cuisinier"]
["France","Hauts-de-France","Oise","Creil",null,"Bâtiment",null,null,"Agent de maintenance des bâtiments"]
["France","Hauts-de-France","Oise","Creil",null,"Fonctions supports de l'entreprise",null,null,"Comptable assistant"]
["France","Hauts-de-France","Oise","Creil",null,"Insertion et de la médiation",null,null,"Agent de médiation, information, services"]
["France","Hauts-de-France","Oise","Creil",null,"Services aux entreprises et à la personne",null,null,"Agent de propreté et d'hygiène"]
["France","Hauts-de-France","Oise","Creil",null,"Insertion et de la médiation",null,null,"Conseiller en insertion professionnelle"]
["France","Hauts-de-France","Oise","Creil",null,"Industrie",null,null,"Agent de montage et de câblage en électronique"]
["France","Hauts-de-France","Oise","Creil",null,"Réseaux - Télécommunications - Informatique - Numérique",null,null,"Installateur de réseaux de télécommunications"]
["France","Hauts-de-France","Oise","Creil",null,"Transports - logistique",null,null,"Préparateur de commandes en entrepôt"]
["France","Hauts-de-France","Oise","Creil",null,"Commerce - vente - distribution",null,null,"Vendeur-conseil en magasin"]
["France","Hauts-de-France","Oise","Creil",null,"Fonctions supports de l'entreprise",null,null,"Gestionnaire de paie"]
["France","Hauts-de-France","Oise","Creil",null,"Fonctions supports de l'entreprise",null,null,"Assistant ressources humaines"]
["France","Hauts-de-France","Oise","Creil",null,"Industrie",null,null,"Conducteur de machines de plasturgie"]
["France","Hauts-de-France","Nord","Douai Cantin",null,"Transports - logistique",null,null,"Conducteur du transport routier de marchandises sur porteur"]
["France","Hauts-de-France","Nord","Douai Cantin",null,"Transports - logistique",null,null,"Conducteur de transport en commun sur route"]
["France","Hauts-de-France","Nord","Douai Cantin",null,"Industrie",null,null,"Mécanicien réparateur de véhicules industriels"]
["France","Hauts-de-France","Nord","Douai Cantin",null,"Bâtiment",null,null,"Maçon en voirie et réseaux divers"]
["France","Hauts-de-France","Nord","Douai Cantin",null,"Travaux publics",null,null,"Maçon en voirie et réseaux divers"]
["France","Hauts-de-France","Nord","Douai Cantin",null,"Bâtiment",null,null,"Couvreur-zingueur"]
["France","Hauts-de-France","Nord","Douai Cantin",null,"Transports - logistique",null,null,"Technicien supérieur / Technicienne supérieure en méthodes et exploitation logistique"]
["France","Hauts-de-France","Nord","Douai Cantin",null,"Bâtiment",null,null,"Installateur en thermique et sanitaire"]
["France","Hauts-de-France","Nord","Douai Cantin",null,"Bâtiment",null,null,"Maçon"]
["France","Hauts-de-France","Nord","Douai Cantin",null,"Transports - logistique",null,null,"Conducteur livreur sur véhicule utilitaire léger"]
["France","Hauts-de-France","Nord","Douai Cantin",null,"Bâtiment",null,null,"Plaquiste-plâtrier"]
["France","Hauts-de-France","Nord","Douai Cantin",null,"Bâtiment",null,null,"Agent de maintenance des bâtiments"]
["France","Hauts-de-France","Nord","Douai Cantin",null,"Services aux entreprises et à la personne",null,null,"Assistant de vie aux familles"]
["France","Hauts-de-France","Nord","Douai Cantin",null,"Travaux publics",null,null,"Canalisateur"]
["France","Hauts-de-France","Nord","Douai Cantin",null,"Transports - logistique",null,null,"Technicien(ne) en logistique d'entreposage"]
["France","Hauts-de-France","Nord","Douai Cantin",null,"Bâtiment",null,null,"Electricien d'équipement du bâtiment"]
["France","Hauts-de-France","Nord","Douai Cantin",null,"Transports - logistique",null,null,"Préparateur de commandes en entrepôt"]
["France","Hauts-de-France","Nord","Douai Cantin",null,"Transports - logistique",null,null,"Cariste d'entrepôt"]
["France","Hauts-de-France","Nord","Douai Cantin",null,"Transports - logistique",null,null,"Enseignant de la conduite et de la sécurité routière"]
["France","Hauts-de-France","Nord","Douai Cantin",null,"Bâtiment",null,null,"Menuisier poseur-installateur"]
["France","Hauts-de-France","Nord","Douai Cantin",null,"Services aux entreprises et à la personne",null,null,"Responsable-coordonnateur services au domicile"]
["France","Hauts-de-France","Nord","Douai Cantin",null,"Bâtiment",null,null,"Carreleur-chapiste"]
["France","Hauts-de-France","Nord","Dunkerque",null,"Bâtiment",null,null,"Installateur en thermique et sanitaire"]
["France","Hauts-de-France","Nord","Dunkerque",null,"Industrie",null,null,"Conducteur d'installation et de machines automatisées"]
["France","Hauts-de-France","Nord","Dunkerque",null,"Industrie",null,null,"Electromécanicien de maintenance industrielle"]
["France","Hauts-de-France","Nord","Dunkerque",null,"Industrie",null,null,"Electricien d’installation et de maintenance des systèmes automatisés"]
["France","Hauts-de-France","Nord","Dunkerque",null,"Industrie",null,null,"Technicien(ne) supérieur(e) en automatique et informatique industrielle"]
["France","Hauts-de-France","Nord","Dunkerque",null,"Réseaux - Télécommunications - Informatique - Numérique",null,null,"Installateur dépanneur en informatique"]
["France","Hauts-de-France","Nord","Dunkerque",null,"Fonctions supports de l'entreprise",null,null,"Formateur professionnel d'adultes"]
["France","Hauts-de-France","Nord","Dunkerque",null,"Services aux entreprises et à la personne",null,null,"Agent de propreté et d'hygiène"]
["France","Hauts-de-France","Nord","Dunkerque",null,"Insertion et de la médiation",null,null,"Conseiller en insertion professionnelle"]
["France","Hauts-de-France","Nord","Dunkerque",null,"Industrie",null,null,"Technicien de maintenance industrielle"]
["France","Hauts-de-France","Nord","Dunkerque",null,"Fonctions supports de l'entreprise",null,null,"Gestionnaire de paie"]
["France","Hauts-de-France","Nord","Dunkerque",null,"Réseaux - Télécommunications - Informatique - Numérique",null,null,"Concepteur développeur d’applications"]
["France","Hauts-de-France","Nord","Dunkerque",null,"Fonctions supports de l'entreprise",null,null,"Assistant ressources humaines"]
["France","Hauts-de-France","Nord","Dunkerque",null,"Bâtiment",null,null,"Menuisier poseur-installateur"]
["France","Hauts-de-France","Nord","Dunkerque",null,"Réseaux - Télécommunications - Informatique - Numérique",null,null,"Technicien supérieur systèmes et réseaux"]
["France","Hauts-de-France","Nord","Hazebrouck",null,"Industrie",null,null,"Tuyauteur industriel"]
["France","Hauts-de-France","Nord","Hazebrouck",null,"Industrie",null,null,"Conducteur d'installation et de machines automatisées"]
["France","Hauts-de-France","Nord","Hazebrouck",null,"Industrie",null,null,"Mécanicien(ne) de maintenance automobile"]
["France","Hauts-de-France","Nord","Hazebrouck",null,"Travaux publics",null,null,"Monteur de réseaux électriques aéro-souterrains"]
["France","Hauts-de-France","Nord","Hazebrouck",null,"Fonctions supports de l'entreprise",null,null,"Formateur professionnel d'adultes"]
["France","Hauts-de-France","Nord","Hazebrouck",null,"Industrie",null,null,"Agent de fabrication industrielle"]
["France","Hauts-de-France","Nord","Hazebrouck",null,"Bâtiment",null,null,"Agent de maintenance des bâtiments"]
["France","Hauts-de-France","Nord","Hazebrouck",null,"Services aux entreprises et à la personne",null,null,"Assistant de vie aux familles"]
["France","Hauts-de-France","Nord","Hazebrouck",null,"Insertion et de la médiation",null,null,"Conseiller en insertion professionnelle"]
["France","Hauts-de-France","Nord","Hazebrouck",null,"Industrie",null,null,"Technicien(ne) électromécanicien(ne) automobile"]
["France","Hauts-de-France","Nord","Hazebrouck",null,"Bâtiment",null,null,"Electricien d'équipement du bâtiment"]
["France","Hauts-de-France","Nord","Hazebrouck",null,"Transports - logistique",null,null,"Préparateur de commandes en entrepôt"]
["France","Hauts-de-France","Nord","Hazebrouck",null,"Transports - logistique",null,null,"Cariste d'entrepôt"]
["France","Hauts-de-France","Nord","Hazebrouck",null,"Industrie",null,null,"Agent de fabrication et montage en chaudronnerie"]
["France","Hauts-de-France","Nord","Hazebrouck",null,"Industrie",null,null,"Contrôleur technique de véhicule léger"]
["France","Hauts-de-France","Aisne","Laon",null,"Travaux publics",null,null,"Maçon en voirie et réseaux divers"]
["France","Hauts-de-France","Aisne","Laon",null,"Bâtiment",null,null,"Installateur en thermique et sanitaire"]
["France","Hauts-de-France","Aisne","Laon",null,"Hôtellerie - restauration - tourisme - loisirs",null,null,"Agent(e) de restauration"]
["France","Hauts-de-France","Aisne","Laon",null,"Bâtiment",null,null,"Agent de maintenance des bâtiments"]
["France","Hauts-de-France","Aisne","Laon",null,"Services aux entreprises et à la personne",null,null,"Assistant de vie aux familles"]
["France","Hauts-de-France","Aisne","Laon",null,"Insertion et de la médiation",null,null,"Conseiller en insertion professionnelle"]
["France","Hauts-de-France","Aisne","Laon",null,"Insertion et de la médiation",null,null,"Encadrant technique d'insertion"]
["France","Hauts-de-France","Aisne","Laon",null,"Bâtiment",null,null,"Electricien d'équipement du bâtiment"]
["France","Hauts-de-France","Aisne","Laon",null,"Transports - logistique",null,null,"Agent magasinier"]
["France","Hauts-de-France","Pas-de-Calais","Liévin",null,"Industrie",null,null,"Tuyauteur industriel"]
["France","Hauts-de-France","Pas-de-Calais","Liévin",null,"Bâtiment",null,null,"Technicien supérieur du bâtiment option économie de la construction"]
["France","Hauts-de-France","Pas-de-Calais","Liévin",null,"Réseaux - Télécommunications - Informatique - Numérique",null,null,"Installateur dépanneur en informatique"]
["France","Hauts-de-France","Pas-de-Calais","Liévin",null,"Bâtiment",null,null,"Plaquiste-plâtrier"]
["France","Hauts-de-France","Pas-de-Calais","Liévin",null,"Bâtiment",null,null,"Agent de maintenance des bâtiments"]
["France","Hauts-de-France","Pas-de-Calais","Liévin",null,"Services aux entreprises et à la personne",null,null,"Assistant de vie aux familles"]
["France","Hauts-de-France","Pas-de-Calais","Liévin",null,"Services aux entreprises et à la personne",null,null,"Agent de propreté et d'hygiène"]
["France","Hauts-de-France","Pas-de-Calais","Liévin",null,"Fonctions supports de l'entreprise",null,null,"Secrétaire comptable"]
["France","Hauts-de-France","Pas-de-Calais","Liévin",null,"Insertion et de la médiation",null,null,"Conseiller en insertion professionnelle"]
["France","Hauts-de-France","Pas-de-Calais","Liévin",null,"Insertion et de la médiation",null,null,"Encadrant technique d'insertion"]
["France","Hauts-de-France","Pas-de-Calais","Liévin",null,"Insertion et de la médiation",null,null,"Médiateur social accès aux droits et services"]
["France","Hauts-de-France","Pas-de-Calais","Liévin",null,"Industrie",null,null,"Opérateur régleur en usinage assisté par ordinateur"]
["France","Hauts-de-France","Pas-de-Calais","Liévin",null,"Fonctions supports de l'entreprise",null,null,"Gestionnaire de paie"]
["France","Hauts-de-France","Pas-de-Calais","Liévin",null,"Industrie",null,null,"Agent de fabrication et montage en chaudronnerie"]
["France","Hauts-de-France","Pas-de-Calais","Liévin",null,"Industrie",null,null,"Tourneur en réalisation de pièces mécaniques"]
["France","Hauts-de-France","Pas-de-Calais","Liévin",null,"Fonctions supports de l'entreprise",null,null,"Assistant ressources humaines"]
["France","Hauts-de-France","Pas-de-Calais","Liévin",null,"Commerce - vente - distribution",null,null,"Assistant commercial"]
["France","Hauts-de-France","Pas-de-Calais","Liévin",null,"Industrie",null,null,"Soudeur TIG électrode enrobée"]
["France","Hauts-de-France","Pas-de-Calais","Liévin",null,"Bâtiment",null,null,"Chargé d'affaires en rénovation énergétique du bâtiment"]
["France","Hauts-de-France","Pas-de-Calais","Liévin",null,"Industrie",null,null,"Soudeur assembleur industriel"]
["France","Hauts-de-France","Pas-de-Calais","Liévin",null,"Industrie",null,null,"Technicien supérieur de contrôle non destructif"]
["France","Hauts-de-France","Nord","Lille Lomme",null,"Industrie",null,null,"Mécanicien(ne) automobile"]
["France","Hauts-de-France","Nord","Lille Lomme",null,"Industrie",null,null,"Carrossier réparateur"]
["France","Hauts-de-France","Nord","Lille Lomme",null,"Bâtiment",null,null,"Couvreur-zingueur"]
["France","Hauts-de-France","Nord","Lille Lomme",null,"Transports - logistique",null,null,"Technicien supérieur / Technicienne supérieure en méthodes et exploitation logistique"]
["France","Hauts-de-France","Nord","Lille Lomme",null,"Industrie",null,null,"Technicien d’après-vente en électroménager et audiovisuel à domicile"]
["France","Hauts-de-France","Nord","Lille Lomme",null,"Bâtiment",null,null,"Technicien d'intervention en froid commercial et climatisation"]
["France","Hauts-de-France","Nord","Lille Lomme",null,"Bâtiment",null,null,"Installateur en thermique et sanitaire"]
["France","Hauts-de-France","Nord","Lille Lomme",null,"Industrie",null,null,"Mécanicien(ne) de maintenance automobile"]
["France","Hauts-de-France","Nord","Lille Lomme",null,"Industrie",null,null,"Electromécanicien de maintenance industrielle"]
["France","Hauts-de-France","Nord","Lille Lomme",null,"Commerce - vente - distribution",null,null,"Employé technicien-vendeur en matériel de sport"]
["France","Hauts-de-France","Nord","Lille Lomme",null,"Bâtiment",null,null,"Agent de maintenance des bâtiments"]
["France","Hauts-de-France","Nord","Lille Lomme",null,"Hôtellerie - restauration - tourisme - loisirs",null,null,"Réceptionniste en hôtellerie"]
["France","Hauts-de-France","Nord","Lille Lomme",null,"Services aux entreprises et à la personne",null,null,"Assistant de vie aux familles"]
["France","Hauts-de-France","Nord","Lille Lomme",null,"Industrie",null,null,"Technicien de maintenance industrielle"]
["France","Hauts-de-France","Nord","Lille Lomme",null,"Industrie",null,null,"Technicien(ne) électromécanicien(ne) automobile"]
["France","Hauts-de-France","Nord","Lille Lomme",null,"Transports - logistique",null,null,"Technicien(ne) en logistique d'entreposage"]
["France","Hauts-de-France","Nord","Lille Lomme",null,"Bâtiment",null,null,"Electricien d'équipement du bâtiment"]
["France","Hauts-de-France","Nord","Lille Lomme",null,"Transports - logistique",null,null,"Préparateur de commandes en entrepôt"]
["France","Hauts-de-France","Nord","Lille Lomme",null,"Transports - logistique",null,null,"Cariste d'entrepôt"]
["France","Hauts-de-France","Nord","Lille Lomme",null,"Bâtiment",null,null,"Technicien du bâtiment communicant et connecté"]
["France","Hauts-de-France","Nord","Lille Lomme",null,"Hôtellerie - restauration - tourisme - loisirs",null,null,"Conseiller vendeur en voyages"]
["France","Hauts-de-France","Nord","Lille Lomme",null,"Industrie",null,null,"Agent technique de réception et de valorisation de déchets"]
["France","Hauts-de-France","Nord","Lille Lomme",null,"Bâtiment",null,null,"Chargé d'affaires en rénovation énergétique du bâtiment"]
["France","Hauts-de-France","Nord","Lille Lomme",null,"Hôtellerie - restauration - tourisme - loisirs",null,null,"Guide accompagnateur touristique"]
["France","Hauts-de-France","Nord","Lille Lomme",null,"Hôtellerie - restauration - tourisme - loisirs",null,null,"Animateur loisir tourisme"]
["France","Hauts-de-France","Nord","Lille Lomme",null,"Bâtiment",null,null,"Technicien d'installation en équipements de confort climatique"]
["France","Hauts-de-France","Nord","Lille Lomme",null,"Hôtellerie - restauration - tourisme - loisirs",null,null,"Chargé d’accueil touristique et de loisirs"]
["France","Hauts-de-France","Nord","Lille Lomme",null,"Bâtiment",null,null,"BIM modeleur du bâtiment"]
["France","Hauts-de-France","Nord","Lille Lomme",null,"Services aux entreprises et à la personne",null,null,"Agent de service médico-social"]
["France","Hauts-de-France","Nord","Lille Lomme",null,"Services aux entreprises et à la personne",null,null,"Responsable-coordonnateur services au domicile"]
["France","Hauts-de-France","Nord","Maubeuge Rousies",null,"Bâtiment",null,null,"Peintre en bâtiment"]
["France","Hauts-de-France","Nord","Maubeuge Rousies",null,"Travaux publics",null,null,"Maçon en voirie et réseaux divers"]
["France","Hauts-de-France","Nord","Maubeuge Rousies",null,"Bâtiment",null,null,"Maçon"]
["France","Hauts-de-France","Nord","Maubeuge Rousies",null,"Réseaux - Télécommunications - Informatique - Numérique",null,null,"Installateur dépanneur en informatique"]
["France","Hauts-de-France","Nord","Maubeuge Rousies",null,"Fonctions supports de l'entreprise",null,null,"Formateur professionnel d'adultes"]
["France","Hauts-de-France","Nord","Maubeuge Rousies",null,"Bâtiment",null,null,"Agent de maintenance des bâtiments"]
["France","Hauts-de-France","Nord","Maubeuge Rousies",null,"Insertion et de la médiation",null,null,"Conseiller en insertion professionnelle"]
["France","Hauts-de-France","Nord","Maubeuge Rousies",null,"Insertion et de la médiation",null,null,"Encadrant technique d'insertion"]
["France","Hauts-de-France","Nord","Roubaix",null,"Fonctions supports de l'entreprise",null,null,"Secrétaire assistant médico-social"]
["France","Hauts-de-France","Nord","Roubaix",null,"Commerce - vente - distribution",null,null,"Assistant manager d’unité marchande"]
["France","Hauts-de-France","Nord","Roubaix",null,"Commerce - vente - distribution",null,null,"Conseiller commercial"]
["France","Hauts-de-France","Nord","Roubaix",null,"Commerce - vente - distribution",null,null,"Manager d’unité marchande"]
["France","Hauts-de-France","Nord","Roubaix",null,"Fonctions supports de l'entreprise",null,null,"Gestionnaire comptable et fiscal"]
["France","Hauts-de-France","Nord","Roubaix",null,"Commerce - vente - distribution",null,null,"Employé commercial en magasin"]
["France","Hauts-de-France","Nord","Roubaix",null,"Fonctions supports de l'entreprise",null,null,"Formateur professionnel d'adultes"]
["France","Hauts-de-France","Nord","Roubaix",null,"Fonctions supports de l'entreprise",null,null,"Secrétaire assistant"]
["France","Hauts-de-France","Nord","Roubaix",null,"Fonctions supports de l'entreprise",null,null,"Comptable assistant"]
["France","Hauts-de-France","Nord","Roubaix",null,"Services aux entreprises et à la personne",null,null,"Assistant de vie aux familles"]
["France","Hauts-de-France","Nord","Roubaix",null,"Insertion et de la médiation",null,null,"Agent de médiation, information, services"]
["France","Hauts-de-France","Nord","Roubaix",null,"Services aux entreprises et à la personne",null,null,"Agent de propreté et d'hygiène"]
["France","Hauts-de-France","Nord","Roubaix",null,"Insertion et de la médiation",null,null,"Conseiller en insertion professionnelle"]
["France","Hauts-de-France","Nord","Roubaix",null,"Insertion et de la médiation",null,null,"Encadrant technique d'insertion"]
["France","Hauts-de-France","Nord","Roubaix",null,"Commerce - vente - distribution",null,null,"Conseiller relation client à distance"]
["France","Hauts-de-France","Nord","Roubaix",null,"Insertion et de la médiation",null,null,"Médiateur social accès aux droits et services"]
["France","Hauts-de-France","Nord","Roubaix",null,"Fonctions supports de l'entreprise",null,null,"Gestionnaire de paie"]
["France","Hauts-de-France","Nord","Roubaix",null,"Commerce - vente - distribution",null,null,"Manager d’équipe relation client à distance"]
["France","Hauts-de-France","Nord","Roubaix",null,"Réseaux - Télécommunications - Informatique - Numérique",null,null,"Développeur web et web mobile"]
["France","Hauts-de-France","Nord","Roubaix",null,"Réseaux - Télécommunications - Informatique - Numérique",null,null,"Concepteur développeur d’applications"]
["France","Hauts-de-France","Nord","Roubaix",null,"Fonctions supports de l'entreprise",null,null,"Assistant ressources humaines"]
["France","Hauts-de-France","Nord","Roubaix",null,"Fonctions supports de l'entreprise",null,null,"Employé administratif et d’accueil"]
["France","Hauts-de-France","Nord","Roubaix",null,"Services aux entreprises et à la personne",null,null,"Agent de service médico-social"]
["France","Hauts-de-France","Nord","Valenciennes Sentinelle",null,"Bâtiment",null,null,"Peintre en bâtiment"]
["France","Hauts-de-France","Nord","Valenciennes Sentinelle",null,"Industrie",null,null,"Technicien d’après-vente en électroménager et audiovisuel à domicile"]
["France","Hauts-de-France","Nord","Valenciennes Sentinelle",null,"Industrie",null,null,"Conducteur d'installation et de machines automatisées"]
["France","Hauts-de-France","Nord","Valenciennes Sentinelle",null,"Bâtiment",null,null,"Maçon"]
["France","Hauts-de-France","Nord","Valenciennes Sentinelle",null,"Bâtiment",null,null,"Plaquiste-plâtrier"]
["France","Hauts-de-France","Nord","Valenciennes Sentinelle",null,"Bâtiment",null,null,"Façadier-peintre"]
["France","Hauts-de-France","Nord","Valenciennes Sentinelle",null,"Insertion et de la médiation",null,null,"Conseiller en insertion professionnelle"]
["France","Hauts-de-France","Nord","Valenciennes Sentinelle",null,"Insertion et de la médiation",null,null,"Encadrant technique d'insertion"]
["France","Hauts-de-France","Nord","Valenciennes Sentinelle",null,"Bâtiment",null,null,"Carreleur-chapiste"]
["France","Normandie","Orne","Alençon",null,"Bâtiment",null,null,"Technicien d'intervention en froid industriel"]
["France","Normandie","Orne","Alençon",null,"Bâtiment",null,null,"Technicien d'intervention en froid commercial et climatisation"]
["France","Normandie","Orne","Alençon",null,"Bâtiment",null,null,"Installateur en thermique et sanitaire"]
["France","Normandie","Orne","Alençon",null,"Bâtiment",null,null,"Agent de maintenance des bâtiments"]
["France","Normandie","Orne","Alençon",null,"Services aux entreprises et à la personne",null,null,"Agent de propreté et d'hygiène"]
["France","Normandie","Orne","Alençon",null,"Insertion et de la médiation",null,null,"Conseiller en insertion professionnelle"]
["France","Normandie","Orne","Alençon",null,"Bâtiment",null,null,"Electricien d'équipement du bâtiment"]
["France","Normandie","Orne","Alençon",null,"Transports - logistique",null,null,"Agent magasinier"]
["France","Normandie","Orne","Alençon",null,"Bâtiment",null,null,"Monteur dépanneur en climatisation"]
["France","Normandie","Orne","Alençon",null,"Industrie",null,null,"Monteur dépanneur en climatisation"]
["France","Normandie","Orne","Alençon",null,"Industrie",null,null,"Soudeur TIG électrode enrobée"]
["France","Normandie","Orne","Alençon",null,"Industrie",null,null,"Technicien en chaudronnerie"]
["France","Normandie","Orne","Alençon",null,"Services aux entreprises et à la personne",null,null,"Agent de sûreté et de sécurité privée"]
["France","Normandie","Orne","Alençon",null,"Industrie",null,null,"Soudeur assembleur industriel"]
["France","Normandie","Calvados","Caen Ifs",null,"Commerce - vente - distribution",null,null,"Conseiller commercial"]
["France","Normandie","Calvados","Caen Ifs",null,"Fonctions supports de l'entreprise",null,null,"Gestionnaire comptable et fiscal"]
["France","Normandie","Calvados","Caen Ifs",null,"Industrie",null,null,"Technicien d’après-vente en électroménager et audiovisuel à domicile"]
["France","Normandie","Calvados","Caen Ifs",null,"Industrie",null,null,"Technicien en usinage assisté par ordinateur"]
["France","Normandie","Calvados","Caen Ifs",null,"Industrie",null,null,"Conducteur d'installation et de machines automatisées"]
["France","Normandie","Calvados","Caen Ifs",null,"Industrie",null,null,"Technicien supérieur de maintenance industrielle"]
["France","Normandie","Calvados","Caen Ifs",null,"Transports - logistique",null,null,"Conducteur livreur sur véhicule utilitaire léger"]
["France","Normandie","Calvados","Caen Ifs",null,"Commerce - vente - distribution",null,null,"Négociateur technico-commercial"]
["France","Normandie","Calvados","Caen Ifs",null,"Fonctions supports de l'entreprise",null,null,"Secrétaire assistant"]
["France","Normandie","Calvados","Caen Ifs",null,"Fonctions supports de l'entreprise",null,null,"Agent de propreté et d'hygiène"]
["France","Normandie","Calvados","Caen Ifs",null,"Fonctions supports de l'entreprise",null,null,"Secrétaire comptable"]
["France","Normandie","Calvados","Caen Ifs",null,"Industrie",null,null,"Technicien de maintenance industrielle"]
["France","Normandie","Calvados","Caen Ifs",null,"Fonctions supports de l'entreprise",null,null,"Gestionnaire de paie"]
["France","Normandie","Calvados","Caen Ifs",null,"Industrie",null,null,"Tourneur en réalisation de pièces mécaniques"]
["France","Normandie","Calvados","Caen Ifs",null,"Industrie",null,null,"Fraiseur en réalisation de pièces mécaniques"]
["France","Normandie","Calvados","Caen Ifs",null,"Commerce - vente - distribution",null,null,"Assistant commercial"]
["France","Normandie","Calvados","Caen Ifs",null,"Réseaux - Télécommunications - Informatique - Numérique",null,null,"Technicien supérieur systèmes et réseaux"]
["France","Normandie","Calvados","Caen Ifs",null,"Industrie",null,null,"Technicien supérieur de maintenance d’éoliennes"]
["France","Normandie","Calvados","Caen Ifs",null,"Hôtellerie - restauration - tourisme - loisirs",null,null,"Responsable d'établissement touristique"]
["France","Normandie","Calvados","Caen Rosel",null,"Industrie",null,null,"Mécanicien(ne) automobile"]
["France","Normandie","Calvados","Caen Rosel",null,"Travaux publics",null,null,"Maçon en voirie et réseaux divers"]
["France","Normandie","Calvados","Caen Rosel",null,"Bâtiment",null,null,"Couvreur-zingueur"]
["France","Normandie","Calvados","Caen Rosel",null,"Commerce - vente - distribution",null,null,"Conseiller commercial"]
["France","Normandie","Calvados","Caen Rosel",null,"Fonctions supports de l'entreprise",null,null,"Gestionnaire comptable et fiscal"]
["France","Normandie","Calvados","Caen Rosel",null,"Bâtiment",null,null,"Installateur en thermique et sanitaire"]
["France","Normandie","Calvados","Caen Rosel",null,"Hôtellerie - restauration - tourisme - loisirs",null,null,"Agent(e) de restauration"]
["France","Normandie","Calvados","Caen Rosel",null,"Bâtiment",null,null,"Maçon"]
["France","Normandie","Calvados","Caen Rosel",null,"Bâtiment",null,null,"Technicien d’équipement et d’exploitation en électricité"]
["France","Normandie","Calvados","Caen Rosel",null,"Industrie",null,null,"Stratifieur multiprocédés en matériaux composites"]
["France","Normandie","Calvados","Caen Rosel",null,"Hôtellerie - restauration - tourisme - loisirs",null,null,"Serveur en restauration"]
["France","Normandie","Calvados","Caen Rosel",null,"Bâtiment",null,null,"Plaquiste-plâtrier"]
["France","Normandie","Calvados","Caen Rosel",null,"Commerce - vente - distribution",null,null,"Négociateur technico-commercial"]
["France","Normandie","Calvados","Caen Rosel",null,"Fonctions supports de l'entreprise",null,null,"Formateur professionnel d'adultes"]
["France","Normandie","Calvados","Caen Rosel",null,"Hôtellerie - restauration - tourisme - loisirs",null,null,"Cuisinier"]
["France","Normandie","Calvados","Caen Rosel",null,"Bâtiment",null,null,"Agent de maintenance des bâtiments"]
["France","Normandie","Calvados","Caen Rosel",null,"Fonctions supports de l'entreprise",null,null,"Secrétaire assistant"]
["France","Normandie","Calvados","Caen Rosel",null,"Services aux entreprises et à la personne",null,null,"Assistant de vie aux familles"]
["France","Normandie","Calvados","Caen Rosel",null,"Services aux entreprises et à la personne",null,null,"Agent de propreté et d'hygiène"]
["France","Normandie","Calvados","Caen Rosel",null,"Fonctions supports de l'entreprise",null,null,"Secrétaire comptable"]
["France","Normandie","Calvados","Caen Rosel",null,"Insertion et de la médiation",null,null,"Conseiller en insertion professionnelle"]
["France","Normandie","Calvados","Caen Rosel",null,"Industrie",null,null,"Technicien(ne) électromécanicien(ne) automobile"]
["France","Normandie","Calvados","Caen Rosel",null,"Bâtiment",null,null,"Electricien d'équipement du bâtiment"]
["France","Normandie","Calvados","Caen Rosel",null,"Commerce - vente - distribution",null,null,"Conseiller relation client à distance"]
["France","Normandie","Calvados","Caen Rosel",null,"Bâtiment",null,null,"Technicien de maintenance d'équipements de confort climatique"]
["France","Normandie","Calvados","Caen Rosel",null,"Commerce - vente - distribution",null,null,"Vendeur-conseil en magasin"]
["France","Normandie","Calvados","Caen Rosel",null,"Fonctions supports de l'entreprise",null,null,"Gestionnaire de paie"]
["France","Normandie","Calvados","Caen Rosel",null,"Commerce - vente - distribution",null,null,"Manager d’équipe relation client à distance"]
["France","Normandie","Calvados","Caen Rosel",null,"Commerce - vente - distribution",null,null,"Assistant commercial"]
["France","Normandie","Calvados","Caen Rosel",null,"Fonctions supports de l'entreprise",null,null,"Assistant commercial"]
["France","Normandie","Calvados","Caen Rosel",null,"Industrie",null,null,"Technicien en chaudronnerie"]
["France","Normandie","Calvados","Caen Rosel",null,"Bâtiment",null,null,"Technicien d'installation en équipements de confort climatique"]
["France","Normandie","Calvados","Caen Rosel",null,"Services aux entreprises et à la personne",null,null,"Agent de sûreté et de sécurité privée"]
["France","Normandie","Calvados","Caen Rosel",null,"Industrie",null,null,"Soudeur assembleur industriel"]
["France","Normandie","Calvados","Caen Rosel",null,"Bâtiment",null,null,"Carreleur-chapiste"]
["France","Normandie","Manche","Cherbourg",null,"Hôtellerie - restauration - tourisme - loisirs",null,null,"Agent(e) de restauration"]
["France","Normandie","Manche","Cherbourg",null,"Bâtiment",null,null,"Maçon"]
["France","Normandie","Manche","Cherbourg",null,"Hôtellerie - restauration - tourisme - loisirs",null,null,"Serveur en restauration"]
["France","Normandie","Manche","Cherbourg",null,"Bâtiment",null,null,"Plaquiste-plâtrier"]
["France","Normandie","Manche","Cherbourg",null,"Hôtellerie - restauration - tourisme - loisirs",null,null,"Cuisinier"]
["France","Normandie","Manche","Cherbourg",null,"Bâtiment",null,null,"Agent de maintenance des bâtiments"]
["France","Normandie","Manche","Cherbourg",null,"Bâtiment",null,null,"Maçon du bâti ancien"]
["France","Normandie","Manche","Cherbourg",null,"Bâtiment",null,null,"Carreleur-chapiste"]
["France","Normandie","Manche","Coutances",null,"Bâtiment",null,null,"Peintre en bâtiment"]
["France","Normandie","Manche","Coutances",null,"Bâtiment",null,null,"Installateur en thermique et sanitaire"]
["France","Normandie","Manche","Coutances",null,"Industrie",null,null,"Conducteur d'installation et de machines automatisées"]
["France","Normandie","Manche","Coutances",null,"Bâtiment",null,null,"Maçon"]
["France","Normandie","Manche","Coutances",null,"Bâtiment",null,null,"Technicien supérieur du bâtiment option économie de la construction"]
["France","Normandie","Manche","Coutances",null,"Bâtiment",null,null,"Plaquiste-plâtrier"]
["France","Normandie","Manche","Coutances",null,"Bâtiment",null,null,"Agent de maintenance des bâtiments"]
["France","Normandie","Manche","Coutances",null,"Fonctions supports de l'entreprise",null,null,"Secrétaire assistant"]
["France","Normandie","Manche","Coutances",null,"Services aux entreprises et à la personne",null,null,"Assistant de vie aux familles"]
["France","Normandie","Manche","Coutances",null,"Fonctions supports de l'entreprise",null,null,"Secrétaire comptable"]
["France","Normandie","Manche","Coutances",null,"Insertion et de la médiation",null,null,"Conseiller en insertion professionnelle"]
["France","Normandie","Manche","Coutances",null,"Bâtiment",null,null,"Electricien d'équipement du bâtiment"]
["France","Normandie","Manche","Coutances",null,"Bâtiment",null,null,"Maçon du bâti ancien"]
["France","Normandie","Manche","Coutances",null,"Industrie",null,null,"Soudeur TIG électrode enrobée"]
["France","Normandie","Manche","Coutances",null,"Bâtiment",null,null,"Chargé d'affaires en rénovation énergétique du bâtiment"]
["France","Normandie","Manche","Coutances",null,"Bâtiment",null,null,"Menuisier poseur-installateur"]
["France","Normandie","Manche","Coutances",null,"Services aux entreprises et à la personne",null,null,"Agent de sûreté et de sécurité privée"]
["France","Normandie","Manche","Coutances",null,"Industrie",null,null,"Soudeur assembleur industriel"]
["France","Normandie","Manche","Coutances",null,"Bâtiment",null,null,"Carreleur-chapiste"]
["France","Normandie","Seine-Maritime","Elbeuf",null,"Commerce - vente - distribution",null,null,"Employé commercial en magasin"]
["France","Normandie","Manche","Equeurdreville",null,"Industrie",null,null,"Tuyauteur industriel"]
["France","Normandie","Manche","Equeurdreville",null,"Industrie",null,null,"Technicien supérieur en conception industrielle de systèmes mécaniques"]
["France","Normandie","Manche","Equeurdreville",null,"Services aux entreprises et à la personne",null,null,"Assistant de vie aux familles"]
["France","Normandie","Manche","Equeurdreville",null,"Bâtiment",null,null,"Electricien d'équipement du bâtiment"]
["France","Normandie","Manche","Equeurdreville",null,"Bâtiment",null,null,"Technicien du bâtiment communicant et connecté"]
["France","Normandie","Manche","Equeurdreville",null,"Industrie",null,null,"Technicien en chaudronnerie"]
["France","Normandie","Manche","Equeurdreville",null,"Réseaux - Télécommunications - Informatique - Numérique",null,null,"Technicien supérieur systèmes et réseaux"]
["France","Normandie","Manche","Equeurdreville",null,"Services aux entreprises et à la personne",null,null,"Agent de sûreté et de sécurité privée"]
["France","Normandie","Eure","Evreux",null,"Industrie",null,null,"Mécanicien(ne) automobile"]
["France","Normandie","Eure","Evreux",null,"Bâtiment",null,null,"Peintre en bâtiment"]
["France","Normandie","Eure","Evreux",null,"Industrie",null,null,"Carrossier réparateur"]
["France","Normandie","Eure","Evreux",null,"Bâtiment",null,null,"Installateur en thermique et sanitaire"]
["France","Normandie","Eure","Evreux",null,"Hôtellerie - restauration - tourisme - loisirs",null,null,"Agent(e) de restauration"]
["France","Normandie","Eure","Evreux",null,"Industrie",null,null,"Conducteur d'installation et de machines automatisées"]
["France","Normandie","Eure","Evreux",null,"Bâtiment",null,null,"Maçon"]
["France","Normandie","Eure","Evreux",null,"Industrie",null,null,"Technicien de production industrielle"]
["France","Normandie","Eure","Evreux",null,"Fonctions supports de l'entreprise",null,null,"Formateur professionnel d'adultes"]
["France","Normandie","Eure","Evreux",null,"Bâtiment",null,null,"Agent de maintenance des bâtiments"]
["France","Normandie","Eure","Evreux",null,"Insertion et de la médiation",null,null,"Conseiller en insertion professionnelle"]
["France","Normandie","Eure","Evreux",null,"Industrie",null,null,"Technicien de maintenance industrielle"]
["France","Normandie","Eure","Evreux",null,"Bâtiment",null,null,"Electricien d'équipement du bâtiment"]
["France","Normandie","Eure","Evreux",null,"Transports - logistique",null,null,"Préparateur de commandes en entrepôt"]
["France","Normandie","Eure","Evreux",null,"Industrie",null,null,"Soudeur TIG électrode enrobée"]
["France","Normandie","Eure","Evreux",null,"Services aux entreprises et à la personne",null,null,"Agent de sûreté et de sécurité privée"]
["France","Normandie","Eure","Evreux",null,"Industrie",null,null,"Soudeur assembleur industriel"]
["France","Normandie","Seine-Maritime","Havre",null,"Industrie",null,null,"Agent de maintenance en marine de plaisance"]
["France","Normandie","Seine-Maritime","Havre",null,"Bâtiment",null,null,"Installateur en thermique et sanitaire"]
["France","Normandie","Seine-Maritime","Havre",null,"Industrie",null,null,"Mécanicien réparateur en marine de plaisance"]
["France","Normandie","Seine-Maritime","Havre",null,"Commerce - vente - distribution",null,null,"Employé commercial en magasin"]
["France","Normandie","Seine-Maritime","Havre",null,"Bâtiment",null,null,"Maçon"]
["France","Normandie","Seine-Maritime","Havre",null,"Industrie",null,null,"Technicien supérieur de maintenance industrielle"]
["France","Normandie","Seine-Maritime","Havre",null,"Bâtiment",null,null,"Ferronnier"]
["France","Normandie","Seine-Maritime","Havre",null,"Fonctions supports de l'entreprise",null,null,"Formateur professionnel d'adultes"]
["France","Normandie","Seine-Maritime","Havre",null,"Industrie",null,null,"Agent de fabrication industrielle"]
["France","Normandie","Seine-Maritime","Havre",null,"Bâtiment",null,null,"Agent de maintenance des bâtiments"]
["France","Normandie","Seine-Maritime","Havre",null,"Services aux entreprises et à la personne",null,null,"Agent de propreté et d'hygiène"]
["France","Normandie","Seine-Maritime","Havre",null,"Insertion et de la médiation",null,null,"Conseiller en insertion professionnelle"]
["France","Normandie","Seine-Maritime","Havre",null,"Industrie",null,null,"Technicien de maintenance industrielle"]
["France","Normandie","Seine-Maritime","Havre",null,"Bâtiment",null,null,"Electricien d'équipement du bâtiment"]
["France","Normandie","Seine-Maritime","Havre",null,"Commerce - vente - distribution",null,null,"Conseiller relation client à distance"]
["France","Normandie","Seine-Maritime","Havre",null,"Commerce - vente - distribution",null,null,"Vendeur-conseil en magasin"]
["France","Normandie","Seine-Maritime","Havre",null,"Commerce - vente - distribution",null,null,"Manager d’équipe relation client à distance"]
["France","Normandie","Seine-Maritime","Havre",null,"Réseaux - Télécommunications - Informatique - Numérique",null,null,"Développeur web et web mobile"]
["France","Normandie","Seine-Maritime","Havre",null,"Industrie",null,null,"Soudeur TIG électrode enrobée"]
["France","Normandie","Seine-Maritime","Havre",null,"Bâtiment",null,null,"Menuisier poseur-installateur"]
["France","Normandie","Seine-Maritime","Havre",null,"Réseaux - Télécommunications - Informatique - Numérique",null,null,"Technicien supérieur systèmes et réseaux"]
["France","Normandie","Seine-Maritime","Havre",null,"Services aux entreprises et à la personne",null,null,"Agent de sûreté et de sécurité privée"]
["France","Normandie","Seine-Maritime","Havre",null,"Industrie",null,null,"Soudeur assembleur industriel"]
["France","Normandie","Seine-Maritime","Rouen St Etienne du Rouvray",null,"Fonctions supports de l'entreprise",null,null,"Secrétaire assistant médico-social"]
["France","Normandie","Seine-Maritime","Rouen St Etienne du Rouvray",null,"Bâtiment",null,null,"Peintre en bâtiment"]
["France","Normandie","Seine-Maritime","Rouen St Etienne du Rouvray",null,"Bâtiment",null,null,"Maçon en voirie et réseaux divers"]
["France","Normandie","Seine-Maritime","Rouen St Etienne du Rouvray",null,"Travaux publics",null,null,"Maçon en voirie et réseaux divers"]
["France","Normandie","Seine-Maritime","Rouen St Etienne du Rouvray",null,"Commerce - vente - distribution",null,null,"Conseiller commercial"]
["France","Normandie","Seine-Maritime","Rouen St Etienne du Rouvray",null,"Fonctions supports de l'entreprise",null,null,"Gestionnaire comptable et fiscal"]
["France","Normandie","Seine-Maritime","Rouen St Etienne du Rouvray",null,"Bâtiment",null,null,"Installateur en thermique et sanitaire"]
["France","Normandie","Seine-Maritime","Rouen St Etienne du Rouvray",null,"Hôtellerie - restauration - tourisme - loisirs",null,null,"Agent(e) de restauration"]
["France","Normandie","Seine-Maritime","Rouen St Etienne du Rouvray",null,"Industrie",null,null,"Technicien en usinage assisté par ordinateur"]
["France","Normandie","Seine-Maritime","Rouen St Etienne du Rouvray",null,"Industrie",null,null,"Conducteur d'installation et de machines automatisées"]
["France","Normandie","Seine-Maritime","Rouen St Etienne du Rouvray",null,"Commerce - vente - distribution",null,null,"Employé commercial en magasin"]
["France","Normandie","Seine-Maritime","Rouen St Etienne du Rouvray",null,"Bâtiment",null,null,"Maçon"]
["France","Normandie","Seine-Maritime","Rouen St Etienne du Rouvray",null,"Industrie",null,null,"Technicien(ne) supérieur(e) en automatique et informatique industrielle"]
["France","Normandie","Seine-Maritime","Rouen St Etienne du Rouvray",null,"Réseaux - Télécommunications - Informatique - Numérique",null,null,"Technicien(ne) supérieur(e) en automatique et informatique industrielle"]
["France","Normandie","Seine-Maritime","Rouen St Etienne du Rouvray",null,"Bâtiment",null,null,"Menuisier agenceur"]
["France","Normandie","Seine-Maritime","Rouen St Etienne du Rouvray",null,"Industrie",null,null,"Technicien de production industrielle"]
["France","Normandie","Seine-Maritime","Rouen St Etienne du Rouvray",null,"Transports - logistique",null,null,"Conducteur livreur sur véhicule utilitaire léger"]
["France","Normandie","Seine-Maritime","Rouen St Etienne du Rouvray",null,"Hôtellerie - restauration - tourisme - loisirs",null,null,"Serveur en restauration"]
["France","Normandie","Seine-Maritime","Rouen St Etienne du Rouvray",null,"Bâtiment",null,null,"Plaquiste-plâtrier"]
["France","Normandie","Seine-Maritime","Rouen St Etienne du Rouvray",null,"Commerce - vente - distribution",null,null,"Négociateur technico-commercial"]
["France","Normandie","Seine-Maritime","Rouen St Etienne du Rouvray",null,"Fonctions supports de l'entreprise",null,null,"Formateur professionnel d'adultes"]
["France","Normandie","Seine-Maritime","Rouen St Etienne du Rouvray",null,"Industrie",null,null,"Agent de fabrication industrielle"]
["France","Normandie","Seine-Maritime","Rouen St Etienne du Rouvray",null,"Hôtellerie - restauration - tourisme - loisirs",null,null,"Cuisinier"]
["France","Normandie","Seine-Maritime","Rouen St Etienne du Rouvray",null,"Bâtiment",null,null,"Agent de maintenance des bâtiments"]
["France","Normandie","Seine-Maritime","Rouen St Etienne du Rouvray",null,"Fonctions supports de l'entreprise",null,null,"Secrétaire assistant"]
["France","Normandie","Seine-Maritime","Rouen St Etienne du Rouvray",null,"Fonctions supports de l'entreprise",null,null,"Comptable assistant"]
["France","Normandie","Seine-Maritime","Rouen St Etienne du Rouvray",null,"Services aux entreprises et à la personne",null,null,"Assistant de vie aux familles"]
["France","Normandie","Seine-Maritime","Rouen St Etienne du Rouvray",null,"Fonctions supports de l'entreprise",null,null,"Secrétaire comptable"]
["France","Normandie","Seine-Maritime","Rouen St Etienne du Rouvray",null,"Insertion et de la médiation",null,null,"Conseiller en insertion professionnelle"]
["France","Normandie","Seine-Maritime","Rouen St Etienne du Rouvray",null,"Industrie",null,null,"Technicien de maintenance industrielle"]
["France","Normandie","Seine-Maritime","Rouen St Etienne du Rouvray",null,"Travaux publics",null,null,"Canalisateur"]
["France","Normandie","Seine-Maritime","Rouen St Etienne du Rouvray",null,"Bâtiment",null,null,"Electricien d'équipement du bâtiment"]
["France","Normandie","Seine-Maritime","Rouen St Etienne du Rouvray",null,"Bâtiment",null,null,"Technicien du bâtiment communicant et connecté"]
["France","Normandie","Seine-Maritime","Rouen St Etienne du Rouvray",null,"Commerce - vente - distribution",null,null,"Conseiller relation client à distance"]
["France","Normandie","Seine-Maritime","Rouen St Etienne du Rouvray",null,"Commerce - vente - distribution",null,null,"Vendeur-conseil en magasin"]
["France","Normandie","Seine-Maritime","Rouen St Etienne du Rouvray",null,"Bâtiment",null,null,"Chef d'équipe gros œuvre"]
["France","Normandie","Seine-Maritime","Rouen St Etienne du Rouvray",null,"Fonctions supports de l'entreprise",null,null,"Gestionnaire de paie"]
["France","Normandie","Seine-Maritime","Rouen St Etienne du Rouvray",null,"Industrie",null,null,"Tourneur en réalisation de pièces mécaniques"]
["France","Normandie","Seine-Maritime","Rouen St Etienne du Rouvray",null,"Industrie",null,null,"Fraiseur en réalisation de pièces mécaniques"]
["France","Normandie","Seine-Maritime","Rouen St Etienne du Rouvray",null,"Fonctions supports de l'entreprise",null,null,"Assistant ressources humaines"]
["France","Normandie","Seine-Maritime","Rouen St Etienne du Rouvray",null,"Industrie",null,null,"Soudeur TIG électrode enrobée"]
["France","Normandie","Seine-Maritime","Rouen St Etienne du Rouvray",null,"Industrie",null,null,"Technicien en chaudronnerie"]
["France","Normandie","Seine-Maritime","Rouen St Etienne du Rouvray",null,"Bâtiment",null,null,"Technicien d'installation en équipements de confort climatique"]
["France","Normandie","Seine-Maritime","Rouen St Etienne du Rouvray",null,"Bâtiment",null,null,"Coffreur Bancheur"]
["France","Normandie","Seine-Maritime","Rouen St Etienne du Rouvray",null,"Industrie",null,null,"Conducteur d'équipements agroalimentaires"]
["France","Normandie","Seine-Maritime","Rouen St Etienne du Rouvray",null,"Réseaux - Télécommunications - Informatique - Numérique",null,null,"Technicien supérieur systèmes et réseaux"]
["France","Normandie","Seine-Maritime","Rouen St Etienne du Rouvray",null,"Services aux entreprises et à la personne",null,null,"Agent de sûreté et de sécurité privée"]
["France","Normandie","Seine-Maritime","Rouen St Etienne du Rouvray",null,"Industrie",null,null,"Soudeur assembleur industriel"]
["France","Normandie","Seine-Maritime","Rouen St Etienne du Rouvray",null,"Bâtiment",null,null,"Carreleur-chapiste"]
["France","Nouvelle-Aquitaine","Lot-et-Garonne","Agen Foulayronnes",null,"Bâtiment",null,null,"Monteur dépanneur frigoriste"]
["France","Nouvelle-Aquitaine","Lot-et-Garonne","Agen Foulayronnes",null,"Fonctions supports de l'entreprise",null,null,"Secrétaire assistant médico-social"]
["France","Nouvelle-Aquitaine","Lot-et-Garonne","Agen Foulayronnes",null,"Bâtiment",null,null,"Technicien d'intervention en froid commercial et climatisation"]
["France","Nouvelle-Aquitaine","Lot-et-Garonne","Agen Foulayronnes",null,"Industrie",null,null,"Electromécanicien de maintenance industrielle"]
["France","Nouvelle-Aquitaine","Lot-et-Garonne","Agen Foulayronnes",null,"Industrie",null,null,"Electricien d’installation et de maintenance des systèmes automatisés"]
["France","Nouvelle-Aquitaine","Lot-et-Garonne","Agen Foulayronnes",null,"Réseaux - Télécommunications - Informatique - Numérique",null,null,"Installateur dépanneur en informatique"]
["France","Nouvelle-Aquitaine","Lot-et-Garonne","Agen Foulayronnes",null,"Bâtiment",null,null,"Agent de maintenance des bâtiments"]
["France","Nouvelle-Aquitaine","Lot-et-Garonne","Agen Foulayronnes",null,"Fonctions supports de l'entreprise",null,null,"Secrétaire assistant"]
["France","Nouvelle-Aquitaine","Lot-et-Garonne","Agen Foulayronnes",null,"Fonctions supports de l'entreprise",null,null,"Comptable assistant"]
["France","Nouvelle-Aquitaine","Lot-et-Garonne","Agen Foulayronnes",null,"Fonctions supports de l'entreprise",null,null,"Secrétaire comptable"]
["France","Nouvelle-Aquitaine","Lot-et-Garonne","Agen Foulayronnes",null,"Industrie",null,null,"Technicien de maintenance industrielle"]
["France","Nouvelle-Aquitaine","Lot-et-Garonne","Agen Foulayronnes",null,"Bâtiment",null,null,"Electricien d'équipement du bâtiment"]
["France","Nouvelle-Aquitaine","Lot-et-Garonne","Agen Foulayronnes",null,"Fonctions supports de l'entreprise",null,null,"Gestionnaire de paie"]
["France","Nouvelle-Aquitaine","Lot-et-Garonne","Agen Foulayronnes",null,"Fonctions supports de l'entreprise",null,null,"Assistant ressources humaines"]
["France","Nouvelle-Aquitaine","Lot-et-Garonne","Agen Foulayronnes",null,"Industrie",null,null,"Technicien en chaudronnerie"]
["France","Nouvelle-Aquitaine","Lot-et-Garonne","Agen Foulayronnes",null,"Fonctions supports de l'entreprise",null,null,"Employé administratif et d’accueil"]
["France","Nouvelle-Aquitaine","Lot-et-Garonne","Agen Foulayronnes",null,"Industrie",null,null,"Conducteur d'équipements agroalimentaires"]
["France","Nouvelle-Aquitaine","Lot-et-Garonne","Agen Foulayronnes",null,"Industrie",null,null,"Soudeur assembleur industriel"]
["France","Nouvelle-Aquitaine","Charente","Angoulême La Braconne",null,"Bâtiment",null,null,"Peintre en bâtiment"]
["France","Nouvelle-Aquitaine","Charente","Angoulême La Braconne",null,"Bâtiment",null,null,"Maçon en voirie et réseaux divers"]
["France","Nouvelle-Aquitaine","Charente","Angoulême La Braconne",null,"Travaux publics",null,null,"Maçon en voirie et réseaux divers"]
["France","Nouvelle-Aquitaine","Charente","Angoulême La Braconne",null,"Commerce - vente - distribution",null,null,"Conseiller commercial"]
["France","Nouvelle-Aquitaine","Charente","Angoulême La Braconne",null,"Fonctions supports de l'entreprise",null,null,"Gestionnaire comptable et fiscal"]
["France","Nouvelle-Aquitaine","Charente","Angoulême La Braconne",null,"Bâtiment",null,null,"Installateur en thermique et sanitaire"]
["France","Nouvelle-Aquitaine","Charente","Angoulême La Braconne",null,"Industrie",null,null,"Conducteur d'installation et de machines automatisées"]
["France","Nouvelle-Aquitaine","Charente","Angoulême La Braconne",null,"Bâtiment",null,null,"Maçon"]
["France","Nouvelle-Aquitaine","Charente","Angoulême La Braconne",null,"Industrie",null,null,"Technicien supérieur de maintenance industrielle"]
["France","Nouvelle-Aquitaine","Charente","Angoulême La Braconne",null,"Industrie",null,null,"Technicien de production industrielle"]
["France","Nouvelle-Aquitaine","Charente","Angoulême La Braconne",null,"Bâtiment",null,null,"Plaquiste-plâtrier"]
["France","Nouvelle-Aquitaine","Charente","Angoulême La Braconne",null,"Industrie",null,null,"Agent de fabrication industrielle"]
["France","Nouvelle-Aquitaine","Charente","Angoulême La Braconne",null,"Bâtiment",null,null,"Agent de maintenance des bâtiments"]
["France","Nouvelle-Aquitaine","Charente","Angoulême La Braconne",null,"Bâtiment",null,null,"Façadier-peintre"]
["France","Nouvelle-Aquitaine","Charente","Angoulême La Braconne",null,"Services aux entreprises et à la personne",null,null,"Assistant de vie aux familles"]
["France","Nouvelle-Aquitaine","Charente","Angoulême La Braconne",null,"Services aux entreprises et à la personne",null,null,"Agent de propreté et d'hygiène"]
["France","Nouvelle-Aquitaine","Charente","Angoulême La Braconne",null,"Industrie",null,null,"Technicien de maintenance industrielle"]
["France","Nouvelle-Aquitaine","Charente","Angoulême La Braconne",null,"Travaux publics",null,null,"Canalisateur"]
["France","Nouvelle-Aquitaine","Charente","Angoulême La Braconne",null,"Bâtiment",null,null,"Electricien d'équipement du bâtiment"]
["France","Nouvelle-Aquitaine","Charente","Angoulême La Braconne",null,"Bâtiment",null,null,"Agent de maintenance d'équipements de confort climatique"]
["France","Nouvelle-Aquitaine","Charente","Angoulême La Braconne",null,"Commerce - vente - distribution",null,null,"Vendeur-conseil en magasin"]
["France","Nouvelle-Aquitaine","Charente","Angoulême La Braconne",null,"Fonctions supports de l'entreprise",null,null,"Gestionnaire de paie"]
["France","Nouvelle-Aquitaine","Charente","Angoulême La Braconne",null,"Services aux entreprises et à la personne",null,null,"Responsable d’espace de médiation numérique"]
["France","Nouvelle-Aquitaine","Charente","Angoulême La Braconne",null,"Réseaux - Télécommunications - Informatique - Numérique",null,null,"Administrateur d’infrastructures sécurisées"]
["France","Nouvelle-Aquitaine","Charente","Angoulême La Braconne",null,"Services aux entreprises et à la personne",null,null,"Agent de sûreté et de sécurité privée"]
["France","Nouvelle-Aquitaine","Charente","Angoulême La Braconne",null,"Services aux entreprises et à la personne",null,null,"Agent de service médico-social"]
["France","Nouvelle-Aquitaine","Charente","Angoulême La Braconne",null,"Bâtiment",null,null,"Carreleur-chapiste"]
["France","Nouvelle-Aquitaine","Pyrénées-Atlantiques","Bayonne",null,"Fonctions supports de l'entreprise",null,null,"Secrétaire assistant médico-social"]
["France","Nouvelle-Aquitaine","Pyrénées-Atlantiques","Bayonne",null,"Bâtiment",null,null,"Peintre en bâtiment"]
["France","Nouvelle-Aquitaine","Pyrénées-Atlantiques","Bayonne",null,"Commerce - vente - distribution",null,null,"Conseiller commercial"]
["France","Nouvelle-Aquitaine","Pyrénées-Atlantiques","Bayonne",null,"Fonctions supports de l'entreprise",null,null,"Gestionnaire comptable et fiscal"]
["France","Nouvelle-Aquitaine","Pyrénées-Atlantiques","Bayonne",null,"Bâtiment",null,null,"Installateur en thermique et sanitaire"]
["France","Nouvelle-Aquitaine","Pyrénées-Atlantiques","Bayonne",null,"Commerce - vente - distribution",null,null,"Employé commercial en magasin"]
["France","Nouvelle-Aquitaine","Pyrénées-Atlantiques","Bayonne",null,"Bâtiment",null,null,"Maçon"]
["France","Nouvelle-Aquitaine","Pyrénées-Atlantiques","Bayonne",null,"Réseaux - Télécommunications - Informatique - Numérique",null,null,"Installateur dépanneur en informatique"]
["France","Nouvelle-Aquitaine","Pyrénées-Atlantiques","Bayonne",null,"Commerce - vente - distribution",null,null,"Employé technicien-vendeur en matériel de sport"]
["France","Nouvelle-Aquitaine","Pyrénées-Atlantiques","Bayonne",null,"Bâtiment",null,null,"Plaquiste-plâtrier"]
["France","Nouvelle-Aquitaine","Pyrénées-Atlantiques","Bayonne",null,"Commerce - vente - distribution",null,null,"Négociateur technico-commercial"]
["France","Nouvelle-Aquitaine","Pyrénées-Atlantiques","Bayonne",null,"Bâtiment",null,null,"Agent de maintenance des bâtiments"]
["France","Nouvelle-Aquitaine","Pyrénées-Atlantiques","Bayonne",null,"Fonctions supports de l'entreprise",null,null,"Secrétaire assistant"]
["France","Nouvelle-Aquitaine","Pyrénées-Atlantiques","Bayonne",null,"Fonctions supports de l'entreprise",null,null,"Comptable assistant"]
["France","Nouvelle-Aquitaine","Pyrénées-Atlantiques","Bayonne",null,"Services aux entreprises et à la personne",null,null,"Assistant de vie aux familles"]
["France","Nouvelle-Aquitaine","Pyrénées-Atlantiques","Bayonne",null,"Fonctions supports de l'entreprise",null,null,"Secrétaire comptable"]
["France","Nouvelle-Aquitaine","Pyrénées-Atlantiques","Bayonne",null,"Insertion et de la médiation",null,null,"Conseiller en insertion professionnelle"]
["France","Nouvelle-Aquitaine","Pyrénées-Atlantiques","Bayonne",null,"Bâtiment",null,null,"Electricien d'équipement du bâtiment"]
["France","Nouvelle-Aquitaine","Pyrénées-Atlantiques","Bayonne",null,"Réseaux - Télécommunications - Informatique - Numérique",null,null,"Technicien d'assistance en informatique"]
["France","Nouvelle-Aquitaine","Pyrénées-Atlantiques","Bayonne",null,"Réseaux - Télécommunications - Informatique - Numérique",null,null,"Technicien réseaux IP"]
["France","Nouvelle-Aquitaine","Pyrénées-Atlantiques","Bayonne",null,"Commerce - vente - distribution",null,null,"Vendeur-conseil en magasin"]
["France","Nouvelle-Aquitaine","Pyrénées-Atlantiques","Bayonne",null,"Fonctions supports de l'entreprise",null,null,"Gestionnaire de paie"]
["France","Nouvelle-Aquitaine","Pyrénées-Atlantiques","Bayonne",null,"Fonctions supports de l'entreprise",null,null,"Assistant ressources humaines"]
["France","Nouvelle-Aquitaine","Pyrénées-Atlantiques","Bayonne",null,"Commerce - vente - distribution",null,null,"Assistant commercial"]
["France","Nouvelle-Aquitaine","Pyrénées-Atlantiques","Bayonne",null,"Bâtiment",null,null,"Charpentier bois"]
["France","Nouvelle-Aquitaine","Pyrénées-Atlantiques","Bayonne",null,"Fonctions supports de l'entreprise",null,null,"Employé administratif et d’accueil"]
["France","Nouvelle-Aquitaine","Pyrénées-Atlantiques","Bayonne",null,"Bâtiment",null,null,"Technicien d'installation en équipements de confort climatique"]
["France","Nouvelle-Aquitaine","Pyrénées-Atlantiques","Bayonne",null,"Services aux entreprises et à la personne",null,null,"Responsable d’espace de médiation numérique"]
["France","Nouvelle-Aquitaine","Pyrénées-Atlantiques","Bayonne",null,"Réseaux - Télécommunications - Informatique - Numérique",null,null,"Technicien supérieur systèmes et réseaux"]
["France","Nouvelle-Aquitaine","Pyrénées-Atlantiques","Bayonne",null,"Services aux entreprises et à la personne",null,null,"Agent de sûreté et de sécurité privée"]
["France","Nouvelle-Aquitaine","Pyrénées-Atlantiques","Bayonne",null,"Services aux entreprises et à la personne",null,null,"Agent de service médico-social"]
["France","Nouvelle-Aquitaine","Pyrénées-Atlantiques","Bayonne",null,"Bâtiment",null,null,"Carreleur-chapiste"]
["France","Nouvelle-Aquitaine","Gironde","Bordeaux Bègles",null,"Bâtiment",null,null,"Monteur dépanneur frigoriste"]
["France","Nouvelle-Aquitaine","Gironde","Bordeaux Bègles",null,"Industrie",null,null,"Technicien d’après-vente en électroménager et audiovisuel à domicile"]
["France","Nouvelle-Aquitaine","Gironde","Bordeaux Bègles",null,"Industrie",null,null,"Tuyauteur industriel"]
["France","Nouvelle-Aquitaine","Gironde","Bordeaux Bègles",null,"Industrie",null,null,"Technicien en usinage assisté par ordinateur"]
["France","Nouvelle-Aquitaine","Gironde","Bordeaux Bègles",null,"Industrie",null,null,"Electromécanicien de maintenance industrielle"]
["France","Nouvelle-Aquitaine","Gironde","Bordeaux Bègles",null,"Industrie",null,null,"Stratifieur multiprocédés en matériaux composites"]
["France","Nouvelle-Aquitaine","Gironde","Bordeaux Bègles",null,"Industrie",null,null,"Chaudronnier formeur aéronautique"]
["France","Nouvelle-Aquitaine","Gironde","Bordeaux Bègles",null,"Réseaux - Télécommunications - Informatique - Numérique",null,null,"Installateur dépanneur en informatique"]
["France","Nouvelle-Aquitaine","Gironde","Bordeaux Bègles",null,"Commerce - vente - distribution",null,null,"Employé technicien-vendeur en matériel de sport"]
["France","Nouvelle-Aquitaine","Gironde","Bordeaux Bègles",null,"Industrie",null,null,"Technicien de maintenance industrielle"]
["France","Nouvelle-Aquitaine","Gironde","Bordeaux Bègles",null,"Industrie",null,null,"Ajusteur monteur aéronautique"]
["France","Nouvelle-Aquitaine","Gironde","Bordeaux Bègles",null,"Réseaux - Télécommunications - Informatique - Numérique",null,null,"Technicien d'assistance en informatique"]
["France","Nouvelle-Aquitaine","Gironde","Bordeaux Bègles",null,"Réseaux - Télécommunications - Informatique - Numérique",null,null,"Technicien réseaux IP"]
["France","Nouvelle-Aquitaine","Gironde","Bordeaux Bègles",null,"Industrie",null,null,"Opérateur régleur en usinage assisté par ordinateur"]
["France","Nouvelle-Aquitaine","Gironde","Bordeaux Bègles",null,"Industrie",null,null,"Agent de fabrication et montage en chaudronnerie"]
["France","Nouvelle-Aquitaine","Gironde","Bordeaux Bègles",null,"Industrie",null,null,"Tourneur en réalisation de pièces mécaniques"]
["France","Nouvelle-Aquitaine","Gironde","Bordeaux Bègles",null,"Industrie",null,null,"Fraiseur en réalisation de pièces mécaniques"]
["France","Nouvelle-Aquitaine","Gironde","Bordeaux Bègles",null,"Réseaux - Télécommunications - Informatique - Numérique",null,null,"Développeur web et web mobile"]
["France","Nouvelle-Aquitaine","Gironde","Bordeaux Bègles",null,"Réseaux - Télécommunications - Informatique - Numérique",null,null,"Concepteur développeur d’applications"]
["France","Nouvelle-Aquitaine","Gironde","Bordeaux Bègles",null,"Industrie",null,null,"Opérateur composites hautes performances"]
["France","Nouvelle-Aquitaine","Gironde","Bordeaux Bègles",null,"Industrie",null,null,"Technicien en chaudronnerie"]
["France","Nouvelle-Aquitaine","Gironde","Bordeaux Bègles",null,"Services aux entreprises et à la personne",null,null,"Responsable d’espace de médiation numérique"]
["France","Nouvelle-Aquitaine","Gironde","Bordeaux Bègles",null,"Réseaux - Télécommunications - Informatique - Numérique",null,null,"Administrateur d’infrastructures sécurisées"]
["France","Nouvelle-Aquitaine","Gironde","Bordeaux Bègles",null,"Industrie",null,null,"Soudeur assembleur industriel"]
["France","Nouvelle-Aquitaine","Gironde","Bordeaux Bègles",null,"Réseaux - Télécommunications - Informatique - Numérique",null,null,"Concepteur designer UI"]
["France","Nouvelle-Aquitaine","Gironde","Bordeaux Caudéran",null,"Artisanat d'art",null,null,"Tailleur de pierre"]
["France","Nouvelle-Aquitaine","Gironde","Bordeaux Caudéran",null,"Bâtiment",null,null,"Tailleur de pierre"]
["France","Nouvelle-Aquitaine","Gironde","Bordeaux Caudéran",null,"Bâtiment",null,null,"Peintre en bâtiment"]
["France","Nouvelle-Aquitaine","Gironde","Bordeaux Caudéran",null,"Bâtiment",null,null,"Maçon en voirie et réseaux divers"]
["France","Nouvelle-Aquitaine","Gironde","Bordeaux Caudéran",null,"Travaux publics",null,null,"Maçon en voirie et réseaux divers"]
["France","Nouvelle-Aquitaine","Gironde","Bordeaux Caudéran",null,"Bâtiment",null,null,"Installateur en thermique et sanitaire"]
["France","Nouvelle-Aquitaine","Gironde","Bordeaux Caudéran",null,"Bâtiment",null,null,"Maçon"]
["France","Nouvelle-Aquitaine","Gironde","Bordeaux Caudéran",null,"Bâtiment",null,null,"Technicien supérieur du bâtiment option économie de la construction"]
["France","Nouvelle-Aquitaine","Gironde","Bordeaux Caudéran",null,"Bâtiment",null,null,"Technicien d’équipement et d’exploitation en électricité"]
["France","Nouvelle-Aquitaine","Gironde","Bordeaux Caudéran",null,"Bâtiment",null,null,"Menuisier agenceur"]
["France","Nouvelle-Aquitaine","Gironde","Bordeaux Caudéran",null,"Bâtiment",null,null,"Plaquiste-plâtrier"]
["France","Nouvelle-Aquitaine","Gironde","Bordeaux Caudéran",null,"Bâtiment",null,null,"Agent de maintenance des bâtiments"]
["France","Nouvelle-Aquitaine","Gironde","Bordeaux Caudéran",null,"Réseaux - Télécommunications - Informatique - Numérique",null,null,"Installateur de réseaux de télécommunications"]
["France","Nouvelle-Aquitaine","Gironde","Bordeaux Caudéran",null,"Bâtiment",null,null,"Menuisier de fabrication bois et dérivés"]
["France","Nouvelle-Aquitaine","Gironde","Bordeaux Caudéran",null,"Bâtiment",null,null,"Electricien d'équipement du bâtiment"]
["France","Nouvelle-Aquitaine","Gironde","Bordeaux Caudéran",null,"Bâtiment",null,null,"Agent de maintenance d'équipements de confort climatique"]
["France","Nouvelle-Aquitaine","Gironde","Bordeaux Caudéran",null,"Bâtiment",null,null,"Monteur dépanneur en climatisation"]
["France","Nouvelle-Aquitaine","Gironde","Bordeaux Caudéran",null,"Bâtiment",null,null,"Charpentier bois"]
["France","Nouvelle-Aquitaine","Gironde","Bordeaux Caudéran",null,"Bâtiment",null,null,"Constructeur bois"]
["France","Nouvelle-Aquitaine","Gironde","Bordeaux Caudéran",null,"Bâtiment",null,null,"Technicien d'études du bâtiment en dessin de projet"]
["France","Nouvelle-Aquitaine","Gironde","Bordeaux Caudéran",null,"Bâtiment",null,null,"Technicien d'installation en équipements de confort climatique"]
["France","Nouvelle-Aquitaine","Gironde","Bordeaux Caudéran",null,"Bâtiment",null,null,"Coffreur Bancheur"]
["France","Nouvelle-Aquitaine","Gironde","Bordeaux Caudéran",null,"Bâtiment",null,null,"Peintre Décorateur"]
["France","Nouvelle-Aquitaine","Gironde","Bordeaux Caudéran",null,"Bâtiment",null,null,"Menuisier poseur-installateur"]
["France","Nouvelle-Aquitaine","Gironde","Bordeaux Caudéran",null,"Bâtiment",null,null,"Coordinateur BIM du bâtiment"]
["France","Nouvelle-Aquitaine","Gironde","Bordeaux Caudéran",null,"Bâtiment",null,null,"Technicien supérieur du bâtiment option étude de prix"]
["France","Nouvelle-Aquitaine","Gironde","Bordeaux Caudéran",null,"Bâtiment",null,null,"BIM modeleur du bâtiment"]
["France","Nouvelle-Aquitaine","Gironde","Bordeaux Caudéran",null,"Bâtiment",null,null,"Carreleur-chapiste"]
["France","Nouvelle-Aquitaine","Gironde","Bordeaux Pessac",null,"Fonctions supports de l'entreprise",null,null,"Secrétaire assistant médico-social"]
["France","Nouvelle-Aquitaine","Gironde","Bordeaux Pessac",null,"Fonctions supports de l'entreprise",null,null,"Formateur professionnel d'adultes"]
["France","Nouvelle-Aquitaine","Gironde","Bordeaux Pessac",null,"Fonctions supports de l'entreprise",null,null,"Secrétaire assistant"]
["France","Nouvelle-Aquitaine","Gironde","Bordeaux Pessac",null,"Fonctions supports de l'entreprise",null,null,"Comptable assistant"]
["France","Nouvelle-Aquitaine","Gironde","Bordeaux Pessac",null,"Services aux entreprises et à la personne",null,null,"Assistant de vie aux familles"]
["France","Nouvelle-Aquitaine","Gironde","Bordeaux Pessac",null,"Fonctions supports de l'entreprise",null,null,"Secrétaire comptable"]
["France","Nouvelle-Aquitaine","Gironde","Bordeaux Pessac",null,"Insertion et de la médiation",null,null,"Conseiller en insertion professionnelle"]
["France","Nouvelle-Aquitaine","Gironde","Bordeaux Pessac",null,"Commerce - vente - distribution",null,null,"Conseiller relation client à distance"]
["France","Nouvelle-Aquitaine","Gironde","Bordeaux Pessac",null,"Fonctions supports de l'entreprise",null,null,"Gestionnaire de paie"]
["France","Nouvelle-Aquitaine","Gironde","Bordeaux Pessac",null,"Fonctions supports de l'entreprise",null,null,"Assistant ressources humaines"]
["France","Nouvelle-Aquitaine","Gironde","Bordeaux Pessac",null,"Commerce - vente - distribution",null,null,"Assistant commercial"]
["France","Nouvelle-Aquitaine","Gironde","Bordeaux Pessac",null,"Fonctions supports de l'entreprise",null,null,"Assistant de direction"]
["France","Nouvelle-Aquitaine","Gironde","Bordeaux Pessac",null,"Fonctions supports de l'entreprise",null,null,"Employé administratif et d’accueil"]
["France","Nouvelle-Aquitaine","Corrèze","Brive la Gaillarde",null,"Fonctions supports de l'entreprise",null,null,"Secrétaire assistant médico-social"]
["France","Nouvelle-Aquitaine","Corrèze","Brive la Gaillarde",null,"Bâtiment",null,null,"Peintre en bâtiment"]
["France","Nouvelle-Aquitaine","Corrèze","Brive la Gaillarde",null,"Commerce - vente - distribution",null,null,"Conseiller commercial"]
["France","Nouvelle-Aquitaine","Corrèze","Brive la Gaillarde",null,"Hôtellerie - restauration - tourisme - loisirs",null,null,"Agent(e) de restauration"]
["France","Nouvelle-Aquitaine","Corrèze","Brive la Gaillarde",null,"Industrie",null,null,"Technicien en usinage assisté par ordinateur"]
["France","Nouvelle-Aquitaine","Corrèze","Brive la Gaillarde",null,"Commerce - vente - distribution",null,null,"Employé commercial en magasin"]
["France","Nouvelle-Aquitaine","Corrèze","Brive la Gaillarde",null,"Réseaux - Télécommunications - Informatique - Numérique",null,null,"Installateur dépanneur en informatique"]
["France","Nouvelle-Aquitaine","Corrèze","Brive la Gaillarde",null,"Hôtellerie - restauration - tourisme - loisirs",null,null,"Serveur en restauration"]
["France","Nouvelle-Aquitaine","Corrèze","Brive la Gaillarde",null,"Commerce - vente - distribution",null,null,"Négociateur technico-commercial"]
["France","Nouvelle-Aquitaine","Corrèze","Brive la Gaillarde",null,"Fonctions supports de l'entreprise",null,null,"Formateur professionnel d'adultes"]
["France","Nouvelle-Aquitaine","Corrèze","Brive la Gaillarde",null,"Hôtellerie - restauration - tourisme - loisirs",null,null,"Cuisinier"]
["France","Nouvelle-Aquitaine","Corrèze","Brive la Gaillarde",null,"Bâtiment",null,null,"Agent de maintenance des bâtiments"]
["France","Nouvelle-Aquitaine","Corrèze","Brive la Gaillarde",null,"Fonctions supports de l'entreprise",null,null,"Secrétaire assistant"]
["France","Nouvelle-Aquitaine","Corrèze","Brive la Gaillarde",null,"Fonctions supports de l'entreprise",null,null,"Comptable assistant"]
["France","Nouvelle-Aquitaine","Corrèze","Brive la Gaillarde",null,"Services aux entreprises et à la personne",null,null,"Assistant de vie aux familles"]
["France","Nouvelle-Aquitaine","Corrèze","Brive la Gaillarde",null,"Services aux entreprises et à la personne",null,null,"Agent de propreté et d'hygiène"]
["France","Nouvelle-Aquitaine","Corrèze","Brive la Gaillarde",null,"Fonctions supports de l'entreprise",null,null,"Secrétaire comptable"]
["France","Nouvelle-Aquitaine","Corrèze","Brive la Gaillarde",null,"Insertion et de la médiation",null,null,"Conseiller en insertion professionnelle"]
["France","Nouvelle-Aquitaine","Corrèze","Brive la Gaillarde",null,"Réseaux - Télécommunications - Informatique - Numérique",null,null,"Technicien d'assistance en informatique"]
["France","Nouvelle-Aquitaine","Corrèze","Brive la Gaillarde",null,"Commerce - vente - distribution",null,null,"Conseiller relation client à distance"]
["France","Nouvelle-Aquitaine","Corrèze","Brive la Gaillarde",null,"Commerce - vente - distribution",null,null,"Vendeur-conseil en magasin"]
["France","Nouvelle-Aquitaine","Corrèze","Brive la Gaillarde",null,"Fonctions supports de l'entreprise",null,null,"Gestionnaire de paie"]
["France","Nouvelle-Aquitaine","Corrèze","Brive la Gaillarde",null,"Industrie",null,null,"Tourneur en réalisation de pièces mécaniques"]
["France","Nouvelle-Aquitaine","Corrèze","Brive la Gaillarde",null,"Industrie",null,null,"Fraiseur en réalisation de pièces mécaniques"]
["France","Nouvelle-Aquitaine","Corrèze","Brive la Gaillarde",null,"Réseaux - Télécommunications - Informatique - Numérique",null,null,"Développeur web et web mobile"]
["France","Nouvelle-Aquitaine","Corrèze","Brive la Gaillarde",null,"Réseaux - Télécommunications - Informatique - Numérique",null,null,"Concepteur développeur d’applications"]
["France","Nouvelle-Aquitaine","Corrèze","Brive la Gaillarde",null,"Fonctions supports de l'entreprise",null,null,"Assistant ressources humaines"]
["France","Nouvelle-Aquitaine","Corrèze","Brive la Gaillarde",null,"Commerce - vente - distribution",null,null,"Assistant commercial"]
["France","Nouvelle-Aquitaine","Corrèze","Brive la Gaillarde",null,"Fonctions supports de l'entreprise",null,null,"Employé administratif et d’accueil"]
["France","Nouvelle-Aquitaine","Corrèze","Brive la Gaillarde",null,"Réseaux - Télécommunications - Informatique - Numérique",null,null,"Technicien supérieur systèmes et réseaux"]
["France","Nouvelle-Aquitaine","Corrèze","Brive la Gaillarde",null,"Services aux entreprises et à la personne",null,null,"Agent de service médico-social"]
["France","Nouvelle-Aquitaine","Corrèze","Brive la Gaillarde",null,"Hôtellerie - restauration - tourisme - loisirs",null,null,"Responsable d'établissement touristique"]
["France","Nouvelle-Aquitaine","Corrèze","Brive la Gaillarde",null,"Hôtellerie - restauration - tourisme - loisirs",null,null,"Responsable de développement touristique territorial"]
["France","Nouvelle-Aquitaine","Vienne","Châtellerault",null,"Commerce - vente - distribution",null,null,"Assistant manager d’unité marchande"]
["France","Nouvelle-Aquitaine","Vienne","Châtellerault",null,"Industrie",null,null,"Carrossier réparateur"]
["France","Nouvelle-Aquitaine","Vienne","Châtellerault",null,"Industrie",null,null,"Peintre en carrosserie"]
["France","Nouvelle-Aquitaine","Vienne","Châtellerault",null,"Commerce - vente - distribution",null,null,"Conseiller commercial"]
["France","Nouvelle-Aquitaine","Vienne","Châtellerault",null,"Industrie",null,null,"Technicien d’après-vente en électroménager et audiovisuel à domicile"]
["France","Nouvelle-Aquitaine","Vienne","Châtellerault",null,"Industrie",null,null,"Tuyauteur industriel"]
["France","Nouvelle-Aquitaine","Vienne","Châtellerault",null,"Commerce - vente - distribution",null,null,"Employé commercial en magasin"]
["France","Nouvelle-Aquitaine","Vienne","Châtellerault",null,"Industrie",null,null,"Technicien supérieur de maintenance industrielle"]
["France","Nouvelle-Aquitaine","Vienne","Châtellerault",null,"Industrie",null,null,"Electromécanicien de maintenance industrielle"]
["France","Nouvelle-Aquitaine","Vienne","Châtellerault",null,"Industrie",null,null,"Technicien de production industrielle"]
["France","Nouvelle-Aquitaine","Vienne","Châtellerault",null,"Réseaux - Télécommunications - Informatique - Numérique",null,null,"Installateur dépanneur en informatique"]
["France","Nouvelle-Aquitaine","Vienne","Châtellerault",null,"Commerce - vente - distribution",null,null,"Négociateur technico-commercial"]
["France","Nouvelle-Aquitaine","Vienne","Châtellerault",null,"Fonctions supports de l'entreprise",null,null,"Formateur professionnel d'adultes"]
["France","Nouvelle-Aquitaine","Vienne","Châtellerault",null,"Industrie",null,null,"Agent de fabrication industrielle"]
["France","Nouvelle-Aquitaine","Vienne","Châtellerault",null,"Bâtiment",null,null,"Agent de maintenance des bâtiments"]
["France","Nouvelle-Aquitaine","Vienne","Châtellerault",null,"Hôtellerie - restauration - tourisme - loisirs",null,null,"Réceptionniste en hôtellerie"]
["France","Nouvelle-Aquitaine","Vienne","Châtellerault",null,"Fonctions supports de l'entreprise",null,null,"Comptable assistant"]
["France","Nouvelle-Aquitaine","Vienne","Châtellerault",null,"Services aux entreprises et à la personne",null,null,"Assistant de vie aux familles"]
["France","Nouvelle-Aquitaine","Vienne","Châtellerault",null,"Services aux entreprises et à la personne",null,null,"Agent de propreté et d'hygiène"]
["France","Nouvelle-Aquitaine","Vienne","Châtellerault",null,"Fonctions supports de l'entreprise",null,null,"Secrétaire comptable"]
["France","Nouvelle-Aquitaine","Vienne","Châtellerault",null,"Insertion et de la médiation",null,null,"Conseiller en insertion professionnelle"]
["France","Nouvelle-Aquitaine","Vienne","Châtellerault",null,"Industrie",null,null,"Technicien de maintenance industrielle"]
["France","Nouvelle-Aquitaine","Vienne","Châtellerault",null,"Insertion et de la médiation",null,null,"Encadrant technique d'insertion"]
["France","Nouvelle-Aquitaine","Vienne","Châtellerault",null,"Bâtiment",null,null,"Electricien d'équipement du bâtiment"]
["France","Nouvelle-Aquitaine","Vienne","Châtellerault",null,"Réseaux - Télécommunications - Informatique - Numérique",null,null,"Technicien d'assistance en informatique"]
["France","Nouvelle-Aquitaine","Vienne","Châtellerault",null,"Commerce - vente - distribution",null,null,"Conseiller relation client à distance"]
["France","Nouvelle-Aquitaine","Vienne","Châtellerault",null,"Commerce - vente - distribution",null,null,"Vendeur-conseil en magasin"]
["France","Nouvelle-Aquitaine","Vienne","Châtellerault",null,"Fonctions supports de l'entreprise",null,null,"Gestionnaire de paie"]
["France","Nouvelle-Aquitaine","Vienne","Châtellerault",null,"Industrie",null,null,"Agent de fabrication et montage en chaudronnerie"]
["France","Nouvelle-Aquitaine","Vienne","Châtellerault",null,"Industrie",null,null,"Agent technique de réception et de valorisation de déchets"]
["France","Nouvelle-Aquitaine","Vienne","Châtellerault",null,"Industrie",null,null,"Tourneur en réalisation de pièces mécaniques"]
["France","Nouvelle-Aquitaine","Vienne","Châtellerault",null,"Industrie",null,null,"Fraiseur en réalisation de pièces mécaniques"]
["France","Nouvelle-Aquitaine","Vienne","Châtellerault",null,"Réseaux - Télécommunications - Informatique - Numérique",null,null,"Développeur web et web mobile"]
["France","Nouvelle-Aquitaine","Vienne","Châtellerault",null,"Réseaux - Télécommunications - Informatique - Numérique",null,null,"Concepteur développeur d’applications"]
["France","Nouvelle-Aquitaine","Vienne","Châtellerault",null,"Fonctions supports de l'entreprise",null,null,"Assistant ressources humaines"]
["France","Nouvelle-Aquitaine","Vienne","Châtellerault",null,"Industrie",null,null,"Technicien en chaudronnerie"]
["France","Nouvelle-Aquitaine","Vienne","Châtellerault",null,"Artisanat d'art",null,null,"Piqueur en maroquinerie"]
["France","Nouvelle-Aquitaine","Vienne","Châtellerault",null,"Bâtiment",null,null,"Technicien d'études du bâtiment en dessin de projet"]
["France","Nouvelle-Aquitaine","Vienne","Châtellerault",null,"Bâtiment",null,null,"Conducteur de travaux du bâtiment et du génie civil"]
["France","Nouvelle-Aquitaine","Vienne","Châtellerault",null,"Réseaux - Télécommunications - Informatique - Numérique",null,null,"Technicien supérieur systèmes et réseaux"]
["France","Nouvelle-Aquitaine","Vienne","Châtellerault",null,"Bâtiment",null,null,"Coordinateur BIM du bâtiment"]
["France","Nouvelle-Aquitaine","Vienne","Châtellerault",null,"Services aux entreprises et à la personne",null,null,"Agent de sûreté et de sécurité privée"]
["France","Nouvelle-Aquitaine","Vienne","Châtellerault",null,"Industrie",null,null,"Soudeur assembleur industriel"]
["France","Nouvelle-Aquitaine","Corrèze","Egletons",null,"Industrie",null,null,"Mécanicien(ne) Réparateur(trice) de Matériels de Chantier et de Manutention"]
["France","Nouvelle-Aquitaine","Corrèze","Egletons",null,"Travaux publics",null,null,"Conducteur de grue à tour"]
["France","Nouvelle-Aquitaine","Corrèze","Egletons",null,"Transports - logistique",null,null,"Conducteur du transport routier de marchandises sur tous véhicules"]
["France","Nouvelle-Aquitaine","Corrèze","Egletons",null,"Transports - logistique",null,null,"Conducteur du transport routier de marchandises sur porteur"]
["France","Nouvelle-Aquitaine","Corrèze","Egletons",null,"Transports - logistique",null,null,"Conducteur de transport en commun sur route"]
["France","Nouvelle-Aquitaine","Corrèze","Egletons",null,"Industrie",null,null,"Mécanicien réparateur de véhicules industriels"]
["France","Nouvelle-Aquitaine","Corrèze","Egletons",null,"Bâtiment",null,null,"Maçon en voirie et réseaux divers"]
["France","Nouvelle-Aquitaine","Corrèze","Egletons",null,"Travaux publics",null,null,"Maçon en voirie et réseaux divers"]
["France","Nouvelle-Aquitaine","Corrèze","Egletons",null,"Travaux publics",null,null,"Chef de chantier travaux publics routes et canalisations"]
["France","Nouvelle-Aquitaine","Corrèze","Egletons",null,"Travaux publics",null,null,"Conducteur d’engins de chantiers urbains"]
["France","Nouvelle-Aquitaine","Corrèze","Egletons",null,"Bâtiment",null,null,"Technicien supérieur géomètre topographe option cabinet de géomètre"]
["France","Nouvelle-Aquitaine","Corrèze","Egletons",null,"Transports - logistique",null,null,"Conducteur livreur sur véhicule utilitaire léger"]
["France","Nouvelle-Aquitaine","Corrèze","Egletons",null,"Bâtiment",null,null,"Agent de maintenance des bâtiments"]
["France","Nouvelle-Aquitaine","Corrèze","Egletons",null,"Transports - logistique",null,null,"Cariste d'entrepôt"]
["France","Nouvelle-Aquitaine","Corrèze","Egletons",null,"Transports - logistique",null,null,"Agent magasinier"]
["France","Nouvelle-Aquitaine","Corrèze","Egletons",null,"Travaux publics",null,null,"Conducteur de travaux TP"]
["France","Nouvelle-Aquitaine","Corrèze","Egletons",null,"Travaux publics",null,null,"Technicien supérieur géomètre topographe option entreprise de travaux publics"]
["France","Nouvelle-Aquitaine","Creuse","Guéret",null,"Industrie",null,null,"Carrossier réparateur"]
["France","Nouvelle-Aquitaine","Creuse","Guéret",null,"Fonctions supports de l'entreprise",null,null,"Gestionnaire comptable et fiscal"]
["France","Nouvelle-Aquitaine","Creuse","Guéret",null,"Bâtiment",null,null,"Installateur en thermique et sanitaire"]
["France","Nouvelle-Aquitaine","Creuse","Guéret",null,"Hôtellerie - restauration - tourisme - loisirs",null,null,"Agent(e) de restauration"]
["France","Nouvelle-Aquitaine","Creuse","Guéret",null,"Industrie",null,null,"Conducteur d'installation et de machines automatisées"]
["France","Nouvelle-Aquitaine","Creuse","Guéret",null,"Commerce - vente - distribution",null,null,"Employé commercial en magasin"]
["France","Nouvelle-Aquitaine","Creuse","Guéret",null,"Industrie",null,null,"Mécanicien(ne) de maintenance automobile"]
["France","Nouvelle-Aquitaine","Creuse","Guéret",null,"Réseaux - Télécommunications - Informatique - Numérique",null,null,"Installateur dépanneur en informatique"]
["France","Nouvelle-Aquitaine","Creuse","Guéret",null,"Bâtiment",null,null,"Agent de maintenance des bâtiments"]
["France","Nouvelle-Aquitaine","Creuse","Guéret",null,"Fonctions supports de l'entreprise",null,null,"Secrétaire assistant"]
["France","Nouvelle-Aquitaine","Creuse","Guéret",null,"Fonctions supports de l'entreprise",null,null,"Comptable assistant"]
["France","Nouvelle-Aquitaine","Creuse","Guéret",null,"Services aux entreprises et à la personne",null,null,"Assistant de vie aux familles"]
["France","Nouvelle-Aquitaine","Creuse","Guéret",null,"Fonctions supports de l'entreprise",null,null,"Secrétaire comptable"]
["France","Nouvelle-Aquitaine","Creuse","Guéret",null,"Bâtiment",null,null,"Electricien d'équipement du bâtiment"]
["France","Nouvelle-Aquitaine","Creuse","Guéret",null,"Bâtiment",null,null,"Technicien du bâtiment communicant et connecté"]
["France","Nouvelle-Aquitaine","Creuse","Guéret",null,"Commerce - vente - distribution",null,null,"Vendeur-conseil en magasin"]
["France","Nouvelle-Aquitaine","Creuse","Guéret",null,"Industrie",null,null,"Soudeur assembleur industriel"]
["France","Nouvelle-Aquitaine","Creuse","Guéret",null,"Services aux entreprises et à la personne",null,null,"Agent de service médico-social"]
["France","Nouvelle-Aquitaine","Haute-Vienne","Limoges  Babylone",null,"Bâtiment",null,null,"Peintre en bâtiment"]
["France","Nouvelle-Aquitaine","Haute-Vienne","Limoges  Babylone",null,"Bâtiment",null,null,"Couvreur-zingueur"]
["France","Nouvelle-Aquitaine","Haute-Vienne","Limoges  Babylone",null,"Bâtiment",null,null,"Technicien supérieur d'études en génie climatique"]
["France","Nouvelle-Aquitaine","Haute-Vienne","Limoges  Babylone",null,"Bâtiment",null,null,"Métreur assistant du bâtiment"]
["France","Nouvelle-Aquitaine","Haute-Vienne","Limoges  Babylone",null,"Industrie",null,null,"Technicien d’après-vente en électroménager et audiovisuel à domicile"]
["France","Nouvelle-Aquitaine","Haute-Vienne","Limoges  Babylone",null,"Bâtiment",null,null,"Installateur en thermique et sanitaire"]
["France","Nouvelle-Aquitaine","Haute-Vienne","Limoges  Babylone",null,"Bâtiment",null,null,"Technicien supérieur du bâtiment option économie de la construction"]
["France","Nouvelle-Aquitaine","Haute-Vienne","Limoges  Babylone",null,"Bâtiment",null,null,"Plaquiste-plâtrier"]
["France","Nouvelle-Aquitaine","Haute-Vienne","Limoges  Babylone",null,"Bâtiment",null,null,"Agent de maintenance des bâtiments"]
["France","Nouvelle-Aquitaine","Haute-Vienne","Limoges  Babylone",null,"Services aux entreprises et à la personne",null,null,"Assistant de vie aux familles"]
["France","Nouvelle-Aquitaine","Haute-Vienne","Limoges  Babylone",null,"Services aux entreprises et à la personne",null,null,"Agent de propreté et d'hygiène"]
["France","Nouvelle-Aquitaine","Haute-Vienne","Limoges  Babylone",null,"Bâtiment",null,null,"Chef de chantier gros oeuvre"]
["France","Nouvelle-Aquitaine","Haute-Vienne","Limoges  Babylone",null,"Bâtiment",null,null,"Chef d'équipe gros œuvre"]
["France","Nouvelle-Aquitaine","Haute-Vienne","Limoges  Babylone",null,"Bâtiment",null,null,"Chargé d'affaires du bâtiment"]
["France","Nouvelle-Aquitaine","Haute-Vienne","Limoges  Babylone",null,"Bâtiment",null,null,"Charpentier bois"]
["France","Nouvelle-Aquitaine","Haute-Vienne","Limoges  Babylone",null,"Bâtiment",null,null,"Constructeur bois"]
["France","Nouvelle-Aquitaine","Haute-Vienne","Limoges  Babylone",null,"Bâtiment",null,null,"Chargé d'affaires en rénovation énergétique du bâtiment"]
["France","Nouvelle-Aquitaine","Haute-Vienne","Limoges  Babylone",null,"Services aux entreprises et à la personne",null,null,"Responsable d’espace de médiation numérique"]
["France","Nouvelle-Aquitaine","Haute-Vienne","Limoges  Babylone",null,"Bâtiment",null,null,"Conducteur de travaux du bâtiment et du génie civil"]
["France","Nouvelle-Aquitaine","Haute-Vienne","Limoges  Babylone",null,"Bâtiment",null,null,"Technicien supérieur du bâtiment option étude de prix"]
["France","Nouvelle-Aquitaine","Haute-Vienne","Limoges  Babylone",null,"Bâtiment",null,null,"Technicien métreur du bâtiment"]
["France","Nouvelle-Aquitaine","Haute-Vienne","Limoges  Babylone",null,"Services aux entreprises et à la personne",null,null,"Agent de service médico-social"]
["France","Nouvelle-Aquitaine","Haute-Vienne","Limoges Romanet",null,"Bâtiment",null,null,"Monteur dépanneur frigoriste"]
["France","Nouvelle-Aquitaine","Haute-Vienne","Limoges Romanet",null,"Fonctions supports de l'entreprise",null,null,"Secrétaire assistant médico-social"]
["France","Nouvelle-Aquitaine","Haute-Vienne","Limoges Romanet",null,"Commerce - vente - distribution",null,null,"Assistant manager d’unité marchande"]
["France","Nouvelle-Aquitaine","Haute-Vienne","Limoges Romanet",null,"Commerce - vente - distribution",null,null,"Conseiller commercial"]
["France","Nouvelle-Aquitaine","Haute-Vienne","Limoges Romanet",null,"Commerce - vente - distribution",null,null,"Manager d’unité marchande"]
["France","Nouvelle-Aquitaine","Haute-Vienne","Limoges Romanet",null,"Fonctions supports de l'entreprise",null,null,"Gestionnaire comptable et fiscal"]
["France","Nouvelle-Aquitaine","Haute-Vienne","Limoges Romanet",null,"Bâtiment",null,null,"Technicien d'intervention en froid commercial et climatisation"]
["France","Nouvelle-Aquitaine","Haute-Vienne","Limoges Romanet",null,"Commerce - vente - distribution",null,null,"Employé commercial en magasin"]
["France","Nouvelle-Aquitaine","Haute-Vienne","Limoges Romanet",null,"Bâtiment",null,null,"Maçon"]
["France","Nouvelle-Aquitaine","Haute-Vienne","Limoges Romanet",null,"Réseaux - Télécommunications - Informatique - Numérique",null,null,"Installateur dépanneur en informatique"]
["France","Nouvelle-Aquitaine","Haute-Vienne","Limoges Romanet",null,"Commerce - vente - distribution",null,null,"Négociateur technico-commercial"]
["France","Nouvelle-Aquitaine","Haute-Vienne","Limoges Romanet",null,"Fonctions supports de l'entreprise",null,null,"Formateur professionnel d'adultes"]
["France","Nouvelle-Aquitaine","Haute-Vienne","Limoges Romanet",null,"Bâtiment",null,null,"Agent de maintenance des bâtiments"]
["France","Nouvelle-Aquitaine","Haute-Vienne","Limoges Romanet",null,"Fonctions supports de l'entreprise",null,null,"Secrétaire assistant"]
["France","Nouvelle-Aquitaine","Haute-Vienne","Limoges Romanet",null,"Fonctions supports de l'entreprise",null,null,"Comptable assistant"]
["France","Nouvelle-Aquitaine","Haute-Vienne","Limoges Romanet",null,"Fonctions supports de l'entreprise",null,null,"Secrétaire comptable"]
["France","Nouvelle-Aquitaine","Haute-Vienne","Limoges Romanet",null,"Insertion et de la médiation",null,null,"Conseiller en insertion professionnelle"]
["France","Nouvelle-Aquitaine","Haute-Vienne","Limoges Romanet",null,"Bâtiment",null,null,"Electricien d'équipement du bâtiment"]
["France","Nouvelle-Aquitaine","Haute-Vienne","Limoges Romanet",null,"Réseaux - Télécommunications - Informatique - Numérique",null,null,"Technicien d'assistance en informatique"]
["France","Nouvelle-Aquitaine","Haute-Vienne","Limoges Romanet",null,"Bâtiment",null,null,"Agent de maintenance d'équipements de confort climatique"]
["France","Nouvelle-Aquitaine","Haute-Vienne","Limoges Romanet",null,"Bâtiment",null,null,"Technicien de maintenance d'équipements de confort climatique"]
["France","Nouvelle-Aquitaine","Haute-Vienne","Limoges Romanet",null,"Industrie",null,null,"Mécanicien réparateur de matériels agricoles et d'espaces verts option parcs et jardins"]
["France","Nouvelle-Aquitaine","Haute-Vienne","Limoges Romanet",null,"Industrie",null,null,"Mécanicien réparateur de matériels agricoles et d'espaces verts option machinisme agricole"]
["France","Nouvelle-Aquitaine","Haute-Vienne","Limoges Romanet",null,"Commerce - vente - distribution",null,null,"Vendeur-conseil en magasin"]
["France","Nouvelle-Aquitaine","Haute-Vienne","Limoges Romanet",null,"Industrie",null,null,"Opérateur régleur en usinage assisté par ordinateur"]
["France","Nouvelle-Aquitaine","Haute-Vienne","Limoges Romanet",null,"Fonctions supports de l'entreprise",null,null,"Gestionnaire de paie"]
["France","Nouvelle-Aquitaine","Haute-Vienne","Limoges Romanet",null,"Bâtiment",null,null,"Maçon du bâti ancien"]
["France","Nouvelle-Aquitaine","Haute-Vienne","Limoges Romanet",null,"Industrie",null,null,"Agent de fabrication et montage en chaudronnerie"]
["France","Nouvelle-Aquitaine","Haute-Vienne","Limoges Romanet",null,"Industrie",null,null,"Tourneur en réalisation de pièces mécaniques"]
["France","Nouvelle-Aquitaine","Haute-Vienne","Limoges Romanet",null,"Industrie",null,null,"Fraiseur en réalisation de pièces mécaniques"]
["France","Nouvelle-Aquitaine","Haute-Vienne","Limoges Romanet",null,"Fonctions supports de l'entreprise",null,null,"Assistant ressources humaines"]
["France","Nouvelle-Aquitaine","Haute-Vienne","Limoges Romanet",null,"Commerce - vente - distribution",null,null,"Assistant commercial"]
["France","Nouvelle-Aquitaine","Haute-Vienne","Limoges Romanet",null,"Fonctions supports de l'entreprise",null,null,"Assistant de direction"]
["France","Nouvelle-Aquitaine","Haute-Vienne","Limoges Romanet",null,"Industrie",null,null,"Soudeur TIG électrode enrobée"]
["France","Nouvelle-Aquitaine","Haute-Vienne","Limoges Romanet",null,"Artisanat d'art",null,null,"Piqueur en maroquinerie"]
["France","Nouvelle-Aquitaine","Haute-Vienne","Limoges Romanet",null,"Industrie",null,null,"Soudeur assembleur industriel"]
["France","Nouvelle-Aquitaine","Haute-Vienne","Limoges Romanet",null,"Bâtiment",null,null,"Carreleur-chapiste"]
["France","Nouvelle-Aquitaine","Landes","Mont de Marsan",null,"Fonctions supports de l'entreprise",null,null,"Secrétaire assistant médico-social"]
["France","Nouvelle-Aquitaine","Landes","Mont de Marsan",null,"Bâtiment",null,null,"Peintre en bâtiment"]
["France","Nouvelle-Aquitaine","Landes","Mont de Marsan",null,"Fonctions supports de l'entreprise",null,null,"Gestionnaire comptable et fiscal"]
["France","Nouvelle-Aquitaine","Landes","Mont de Marsan",null,"Bâtiment",null,null,"Installateur en thermique et sanitaire"]
["France","Nouvelle-Aquitaine","Landes","Mont de Marsan",null,"Réseaux - Télécommunications - Informatique - Numérique",null,null,"Installateur dépanneur en informatique"]
["France","Nouvelle-Aquitaine","Landes","Mont de Marsan",null,"Bâtiment",null,null,"Plaquiste-plâtrier"]
["France","Nouvelle-Aquitaine","Landes","Mont de Marsan",null,"Bâtiment",null,null,"Agent de maintenance des bâtiments"]
["France","Nouvelle-Aquitaine","Landes","Mont de Marsan",null,"Fonctions supports de l'entreprise",null,null,"Secrétaire assistant"]
["France","Nouvelle-Aquitaine","Landes","Mont de Marsan",null,"Fonctions supports de l'entreprise",null,null,"Comptable assistant"]
["France","Nouvelle-Aquitaine","Landes","Mont de Marsan",null,"Fonctions supports de l'entreprise",null,null,"Secrétaire comptable"]
["France","Nouvelle-Aquitaine","Landes","Mont de Marsan",null,"Bâtiment",null,null,"Electricien d'équipement du bâtiment"]
["France","Nouvelle-Aquitaine","Landes","Mont de Marsan",null,"Réseaux - Télécommunications - Informatique - Numérique",null,null,"Technicien d'assistance en informatique"]
["France","Nouvelle-Aquitaine","Landes","Mont de Marsan",null,"Fonctions supports de l'entreprise",null,null,"Gestionnaire de paie"]
["France","Nouvelle-Aquitaine","Landes","Mont de Marsan",null,"Réseaux - Télécommunications - Informatique - Numérique",null,null,"Concepteur développeur d’applications"]
["France","Nouvelle-Aquitaine","Landes","Mont de Marsan",null,"Services aux entreprises et à la personne",null,null,"Responsable d’espace de médiation numérique"]
["France","Nouvelle-Aquitaine","Landes","Mont de Marsan",null,"Réseaux - Télécommunications - Informatique - Numérique",null,null,"Technicien supérieur systèmes et réseaux"]
["France","Nouvelle-Aquitaine","Landes","Mont de Marsan",null,"Réseaux - Télécommunications - Informatique - Numérique",null,null,"Administrateur d’infrastructures sécurisées"]
["France","Nouvelle-Aquitaine","Landes","Mont de Marsan",null,"Bâtiment",null,null,"Carreleur-chapiste"]
["France","Nouvelle-Aquitaine","Deux-Sèvres","Niort",null,"Artisanat d'art",null,null,"Tailleur de pierre"]
["France","Nouvelle-Aquitaine","Deux-Sèvres","Niort",null,"Bâtiment",null,null,"Monteur dépanneur frigoriste"]
["France","Nouvelle-Aquitaine","Deux-Sèvres","Niort",null,"Fonctions supports de l'entreprise",null,null,"Secrétaire assistant médico-social"]
["France","Nouvelle-Aquitaine","Deux-Sèvres","Niort",null,"Bâtiment",null,null,"Maçon en voirie et réseaux divers"]
["France","Nouvelle-Aquitaine","Deux-Sèvres","Niort",null,"Travaux publics",null,null,"Maçon en voirie et réseaux divers"]
["France","Nouvelle-Aquitaine","Deux-Sèvres","Niort",null,"Commerce - vente - distribution",null,null,"Conseiller commercial"]
["France","Nouvelle-Aquitaine","Deux-Sèvres","Niort",null,"Bâtiment",null,null,"Technicien d'intervention en froid commercial et climatisation"]
["France","Nouvelle-Aquitaine","Deux-Sèvres","Niort",null,"Bâtiment",null,null,"Installateur en thermique et sanitaire"]
["France","Nouvelle-Aquitaine","Deux-Sèvres","Niort",null,"Industrie",null,null,"Tuyauteur industriel"]
["France","Nouvelle-Aquitaine","Deux-Sèvres","Niort",null,"Industrie",null,null,"Conducteur d'installation et de machines automatisées"]
["France","Nouvelle-Aquitaine","Deux-Sèvres","Niort",null,"Commerce - vente - distribution",null,null,"Employé commercial en magasin"]
["France","Nouvelle-Aquitaine","Deux-Sèvres","Niort",null,"Bâtiment",null,null,"Maçon"]
["France","Nouvelle-Aquitaine","Deux-Sèvres","Niort",null,"Industrie",null,null,"Electricien d’installation et de maintenance des systèmes automatisés"]
["France","Nouvelle-Aquitaine","Deux-Sèvres","Niort",null,"Bâtiment",null,null,"Menuisier agenceur"]
["France","Nouvelle-Aquitaine","Deux-Sèvres","Niort",null,"Industrie",null,null,"Technicien de production industrielle"]
["France","Nouvelle-Aquitaine","Deux-Sèvres","Niort",null,"Réseaux - Télécommunications - Informatique - Numérique",null,null,"Installateur dépanneur en informatique"]
["France","Nouvelle-Aquitaine","Deux-Sèvres","Niort",null,"Fonctions supports de l'entreprise",null,null,"Formateur professionnel d'adultes"]
["France","Nouvelle-Aquitaine","Deux-Sèvres","Niort",null,"Bâtiment",null,null,"Agent de maintenance des bâtiments"]
["France","Nouvelle-Aquitaine","Deux-Sèvres","Niort",null,"Fonctions supports de l'entreprise",null,null,"Secrétaire assistant"]
["France","Nouvelle-Aquitaine","Deux-Sèvres","Niort",null,"Fonctions supports de l'entreprise",null,null,"Comptable assistant"]
["France","Nouvelle-Aquitaine","Deux-Sèvres","Niort",null,"Services aux entreprises et à la personne",null,null,"Assistant de vie aux familles"]
["France","Nouvelle-Aquitaine","Deux-Sèvres","Niort",null,"Fonctions supports de l'entreprise",null,null,"Secrétaire comptable"]
["France","Nouvelle-Aquitaine","Deux-Sèvres","Niort",null,"Industrie",null,null,"Technicien de maintenance industrielle"]
["France","Nouvelle-Aquitaine","Deux-Sèvres","Niort",null,"Bâtiment",null,null,"Electricien d'équipement du bâtiment"]
["France","Nouvelle-Aquitaine","Deux-Sèvres","Niort",null,"Commerce - vente - distribution",null,null,"Conseiller relation client à distance"]
["France","Nouvelle-Aquitaine","Deux-Sèvres","Niort",null,"Commerce - vente - distribution",null,null,"Vendeur-conseil en magasin"]
["France","Nouvelle-Aquitaine","Deux-Sèvres","Niort",null,"Fonctions supports de l'entreprise",null,null,"Gestionnaire de paie"]
["France","Nouvelle-Aquitaine","Deux-Sèvres","Niort",null,"Bâtiment",null,null,"Maçon du bâti ancien"]
["France","Nouvelle-Aquitaine","Deux-Sèvres","Niort",null,"Industrie",null,null,"Agent de fabrication et montage en chaudronnerie"]
["France","Nouvelle-Aquitaine","Deux-Sèvres","Niort",null,"Réseaux - Télécommunications - Informatique - Numérique",null,null,"Développeur web et web mobile"]
["France","Nouvelle-Aquitaine","Deux-Sèvres","Niort",null,"Fonctions supports de l'entreprise",null,null,"Assistant ressources humaines"]
["France","Nouvelle-Aquitaine","Deux-Sèvres","Niort",null,"Industrie",null,null,"Technicien en chaudronnerie"]
["France","Nouvelle-Aquitaine","Deux-Sèvres","Niort",null,"Artisanat d'art",null,null,"Piqueur en maroquinerie"]
["France","Nouvelle-Aquitaine","Deux-Sèvres","Niort",null,"Bâtiment",null,null,"Technicien d'installation en équipements de confort climatique"]
["France","Nouvelle-Aquitaine","Deux-Sèvres","Niort",null,"Bâtiment",null,null,"Menuisier poseur-installateur"]
["France","Nouvelle-Aquitaine","Deux-Sèvres","Niort",null,"Réseaux - Télécommunications - Informatique - Numérique",null,null,"Technicien supérieur systèmes et réseaux"]
["France","Nouvelle-Aquitaine","Deux-Sèvres","Niort",null,"Industrie",null,null,"Soudeur assembleur industriel"]
["France","Nouvelle-Aquitaine","Deux-Sèvres","Niort",null,"Services aux entreprises et à la personne",null,null,"Agent de service médico-social"]
["France","Nouvelle-Aquitaine","Pyrénées-Atlantiques","Pau",null,"Industrie",null,null,"Mécanicien(ne) automobile"]
["France","Nouvelle-Aquitaine","Pyrénées-Atlantiques","Pau",null,"Fonctions supports de l'entreprise",null,null,"Secrétaire assistant médico-social"]
["France","Nouvelle-Aquitaine","Pyrénées-Atlantiques","Pau",null,"Industrie",null,null,"Carrossier réparateur"]
["France","Nouvelle-Aquitaine","Pyrénées-Atlantiques","Pau",null,"Industrie",null,null,"Peintre en carrosserie"]
["France","Nouvelle-Aquitaine","Pyrénées-Atlantiques","Pau",null,"Travaux publics",null,null,"Maçon en voirie et réseaux divers"]
["France","Nouvelle-Aquitaine","Pyrénées-Atlantiques","Pau",null,"Commerce - vente - distribution",null,null,"Conseiller commercial"]
["France","Nouvelle-Aquitaine","Pyrénées-Atlantiques","Pau",null,"Commerce - vente - distribution",null,null,"Manager d’unité marchande"]
["France","Nouvelle-Aquitaine","Pyrénées-Atlantiques","Pau",null,"Industrie",null,null,"Conducteur d'installation et de machines automatisées"]
["France","Nouvelle-Aquitaine","Pyrénées-Atlantiques","Pau",null,"Commerce - vente - distribution",null,null,"Employé commercial en magasin"]
["France","Nouvelle-Aquitaine","Pyrénées-Atlantiques","Pau",null,"Bâtiment",null,null,"Maçon"]
["France","Nouvelle-Aquitaine","Pyrénées-Atlantiques","Pau",null,"Industrie",null,null,"Mécanicien(ne) de maintenance automobile"]
["France","Nouvelle-Aquitaine","Pyrénées-Atlantiques","Pau",null,"Commerce - vente - distribution",null,null,"Employé technicien-vendeur en matériel de sport"]
["France","Nouvelle-Aquitaine","Pyrénées-Atlantiques","Pau",null,"Bâtiment",null,null,"Plaquiste-plâtrier"]
["France","Nouvelle-Aquitaine","Pyrénées-Atlantiques","Pau",null,"Commerce - vente - distribution",null,null,"Négociateur technico-commercial"]
["France","Nouvelle-Aquitaine","Pyrénées-Atlantiques","Pau",null,"Fonctions supports de l'entreprise",null,null,"Formateur professionnel d'adultes"]
["France","Nouvelle-Aquitaine","Pyrénées-Atlantiques","Pau",null,"Bâtiment",null,null,"Agent de maintenance des bâtiments"]
["France","Nouvelle-Aquitaine","Pyrénées-Atlantiques","Pau",null,"Fonctions supports de l'entreprise",null,null,"Secrétaire assistant"]
["France","Nouvelle-Aquitaine","Pyrénées-Atlantiques","Pau",null,"Fonctions supports de l'entreprise",null,null,"Comptable assistant"]
["France","Nouvelle-Aquitaine","Pyrénées-Atlantiques","Pau",null,"Services aux entreprises et à la personne",null,null,"Assistant de vie aux familles"]
["France","Nouvelle-Aquitaine","Pyrénées-Atlantiques","Pau",null,"Fonctions supports de l'entreprise",null,null,"Secrétaire comptable"]
["France","Nouvelle-Aquitaine","Pyrénées-Atlantiques","Pau",null,"Insertion et de la médiation",null,null,"Conseiller en insertion professionnelle"]
["France","Nouvelle-Aquitaine","Pyrénées-Atlantiques","Pau",null,"Insertion et de la médiation",null,null,"Encadrant technique d'insertion"]
["France","Nouvelle-Aquitaine","Pyrénées-Atlantiques","Pau",null,"Réseaux - Télécommunications - Informatique - Numérique",null,null,"Technicien d'assistance en informatique"]
["France","Nouvelle-Aquitaine","Pyrénées-Atlantiques","Pau",null,"Commerce - vente - distribution",null,null,"Vendeur-conseil en magasin"]
["France","Nouvelle-Aquitaine","Pyrénées-Atlantiques","Pau",null,"Fonctions supports de l'entreprise",null,null,"Gestionnaire de paie"]
["France","Nouvelle-Aquitaine","Pyrénées-Atlantiques","Pau",null,"Industrie",null,null,"Agent de fabrication et montage en chaudronnerie"]
["France","Nouvelle-Aquitaine","Pyrénées-Atlantiques","Pau",null,"Fonctions supports de l'entreprise",null,null,"Assistant ressources humaines"]
["France","Nouvelle-Aquitaine","Pyrénées-Atlantiques","Pau",null,"Commerce - vente - distribution",null,null,"Assistant commercial"]
["France","Nouvelle-Aquitaine","Pyrénées-Atlantiques","Pau",null,"Industrie",null,null,"Soudeur TIG électrode enrobée"]
["France","Nouvelle-Aquitaine","Pyrénées-Atlantiques","Pau",null,"Industrie",null,null,"Technicien en chaudronnerie"]
["France","Nouvelle-Aquitaine","Pyrénées-Atlantiques","Pau",null,"Fonctions supports de l'entreprise",null,null,"Employé administratif et d’accueil"]
["France","Nouvelle-Aquitaine","Pyrénées-Atlantiques","Pau",null,"Bâtiment",null,null,"Technicien d'installation en équipements de confort climatique"]
["France","Nouvelle-Aquitaine","Pyrénées-Atlantiques","Pau",null,"Industrie",null,null,"Contrôleur technique de véhicule léger"]
["France","Nouvelle-Aquitaine","Pyrénées-Atlantiques","Pau",null,"Réseaux - Télécommunications - Informatique - Numérique",null,null,"Technicien supérieur systèmes et réseaux"]
["France","Nouvelle-Aquitaine","Pyrénées-Atlantiques","Pau",null,"Réseaux - Télécommunications - Informatique - Numérique",null,null,"Administrateur d’infrastructures sécurisées"]
["France","Nouvelle-Aquitaine","Pyrénées-Atlantiques","Pau",null,"Services aux entreprises et à la personne",null,null,"Agent de sûreté et de sécurité privée"]
["France","Nouvelle-Aquitaine","Pyrénées-Atlantiques","Pau",null,"Industrie",null,null,"Soudeur assembleur industriel"]
["France","Nouvelle-Aquitaine","Pyrénées-Atlantiques","Pau",null,"Services aux entreprises et à la personne",null,null,"Agent de service médico-social"]
["France","Nouvelle-Aquitaine","Dordogne","Périgueux Boulazac",null,"Industrie",null,null,"Mécanicien(ne) automobile"]
["France","Nouvelle-Aquitaine","Dordogne","Périgueux Boulazac",null,"Bâtiment",null,null,"Monteur dépanneur frigoriste"]
["France","Nouvelle-Aquitaine","Dordogne","Périgueux Boulazac",null,"Fonctions supports de l'entreprise",null,null,"Secrétaire assistant médico-social"]
["France","Nouvelle-Aquitaine","Dordogne","Périgueux Boulazac",null,"Bâtiment",null,null,"Peintre en bâtiment"]
["France","Nouvelle-Aquitaine","Dordogne","Périgueux Boulazac",null,"Industrie",null,null,"Carrossier réparateur"]
["France","Nouvelle-Aquitaine","Dordogne","Périgueux Boulazac",null,"Bâtiment",null,null,"Couvreur-zingueur"]
["France","Nouvelle-Aquitaine","Dordogne","Périgueux Boulazac",null,"Bâtiment",null,null,"Installateur en thermique et sanitaire"]
["France","Nouvelle-Aquitaine","Dordogne","Périgueux Boulazac",null,"Hôtellerie - restauration - tourisme - loisirs",null,null,"Agent(e) de restauration"]
["France","Nouvelle-Aquitaine","Dordogne","Périgueux Boulazac",null,"Bâtiment",null,null,"Maçon"]
["France","Nouvelle-Aquitaine","Dordogne","Périgueux Boulazac",null,"Industrie",null,null,"Mécanicien(ne) de maintenance automobile"]
["France","Nouvelle-Aquitaine","Dordogne","Périgueux Boulazac",null,"Réseaux - Télécommunications - Informatique - Numérique",null,null,"Installateur dépanneur en informatique"]
["France","Nouvelle-Aquitaine","Dordogne","Périgueux Boulazac",null,"Bâtiment",null,null,"Plaquiste-plâtrier"]
["France","Nouvelle-Aquitaine","Dordogne","Périgueux Boulazac",null,"Bâtiment",null,null,"Monteur de réseaux électriques aéro-souterrains"]
["France","Nouvelle-Aquitaine","Dordogne","Périgueux Boulazac",null,"Travaux publics",null,null,"Monteur de réseaux électriques aéro-souterrains"]
["France","Nouvelle-Aquitaine","Dordogne","Périgueux Boulazac",null,"Bâtiment",null,null,"Agent de maintenance des bâtiments"]
["France","Nouvelle-Aquitaine","Dordogne","Périgueux Boulazac",null,"Fonctions supports de l'entreprise",null,null,"Secrétaire assistant"]
["France","Nouvelle-Aquitaine","Dordogne","Périgueux Boulazac",null,"Fonctions supports de l'entreprise",null,null,"Comptable assistant"]
["France","Nouvelle-Aquitaine","Dordogne","Périgueux Boulazac",null,"Services aux entreprises et à la personne",null,null,"Assistant de vie aux familles"]
["France","Nouvelle-Aquitaine","Dordogne","Périgueux Boulazac",null,"Fonctions supports de l'entreprise",null,null,"Secrétaire comptable"]
["France","Nouvelle-Aquitaine","Dordogne","Périgueux Boulazac",null,"Insertion et de la médiation",null,null,"Conseiller en insertion professionnelle"]
["France","Nouvelle-Aquitaine","Dordogne","Périgueux Boulazac",null,"Réseaux - Télécommunications - Informatique - Numérique",null,null,"Installateur de réseaux de télécommunications"]
["France","Nouvelle-Aquitaine","Dordogne","Périgueux Boulazac",null,"Bâtiment",null,null,"Electricien d'équipement du bâtiment"]
["France","Nouvelle-Aquitaine","Dordogne","Périgueux Boulazac",null,"Fonctions supports de l'entreprise",null,null,"Gestionnaire de paie"]
["France","Nouvelle-Aquitaine","Dordogne","Périgueux Boulazac",null,"Bâtiment",null,null,"Maçon du bâti ancien"]
["France","Nouvelle-Aquitaine","Dordogne","Périgueux Boulazac",null,"Commerce - vente - distribution",null,null,"Assistant commercial"]
["France","Nouvelle-Aquitaine","Dordogne","Périgueux Boulazac",null,"Bâtiment",null,null,"Charpentier bois"]
["France","Nouvelle-Aquitaine","Dordogne","Périgueux Boulazac",null,"Bâtiment",null,null,"Constructeur bois"]
["France","Nouvelle-Aquitaine","Dordogne","Périgueux Boulazac",null,"Artisanat d'art",null,null,"Piqueur en maroquinerie"]
["France","Nouvelle-Aquitaine","Dordogne","Périgueux Boulazac",null,"Fonctions supports de l'entreprise",null,null,"Employé administratif et d’accueil"]
["France","Nouvelle-Aquitaine","Dordogne","Périgueux Boulazac",null,"Bâtiment",null,null,"Technicien d'installation en équipements de confort climatique"]
["France","Nouvelle-Aquitaine","Dordogne","Périgueux Boulazac",null,"Bâtiment",null,null,"Menuisier poseur-installateur"]
["France","Nouvelle-Aquitaine","Dordogne","Périgueux Boulazac",null,"Services aux entreprises et à la personne",null,null,"Agent de sûreté et de sécurité privée"]
["France","Nouvelle-Aquitaine","Dordogne","Périgueux Boulazac",null,"Services aux entreprises et à la personne",null,null,"Agent de service médico-social"]
["France","Nouvelle-Aquitaine","Dordogne","Périgueux Boulazac",null,"Bâtiment",null,null,"Carreleur-chapiste"]
["France","Nouvelle-Aquitaine","Charente-Maritime","Rochefort",null,"Bâtiment",null,null,"Peintre en bâtiment"]
["France","Nouvelle-Aquitaine","Charente-Maritime","Rochefort",null,"Industrie",null,null,"Agent de maintenance en marine de plaisance"]
["France","Nouvelle-Aquitaine","Charente-Maritime","Rochefort",null,"Bâtiment",null,null,"Maçon en voirie et réseaux divers"]
["France","Nouvelle-Aquitaine","Charente-Maritime","Rochefort",null,"Travaux publics",null,null,"Maçon en voirie et réseaux divers"]
["France","Nouvelle-Aquitaine","Charente-Maritime","Rochefort",null,"Fonctions supports de l'entreprise",null,null,"Gestionnaire comptable et fiscal"]
["France","Nouvelle-Aquitaine","Charente-Maritime","Rochefort",null,"Hôtellerie - restauration - tourisme - loisirs",null,null,"Agent(e) de restauration"]
["France","Nouvelle-Aquitaine","Charente-Maritime","Rochefort",null,"Commerce - vente - distribution",null,null,"Employé commercial en magasin"]
["France","Nouvelle-Aquitaine","Charente-Maritime","Rochefort",null,"Bâtiment",null,null,"Maçon"]
["France","Nouvelle-Aquitaine","Charente-Maritime","Rochefort",null,"Industrie",null,null,"Stratifieur multiprocédés en matériaux composites"]
["France","Nouvelle-Aquitaine","Charente-Maritime","Rochefort",null,"Réseaux - Télécommunications - Informatique - Numérique",null,null,"Installateur dépanneur en informatique"]
["France","Nouvelle-Aquitaine","Charente-Maritime","Rochefort",null,"Commerce - vente - distribution",null,null,"Employé technicien-vendeur en matériel de sport"]
["France","Nouvelle-Aquitaine","Charente-Maritime","Rochefort",null,"Hôtellerie - restauration - tourisme - loisirs",null,null,"Serveur en restauration"]
["France","Nouvelle-Aquitaine","Charente-Maritime","Rochefort",null,"Bâtiment",null,null,"Plaquiste-plâtrier"]
["France","Nouvelle-Aquitaine","Charente-Maritime","Rochefort",null,"Fonctions supports de l'entreprise",null,null,"Formateur professionnel d'adultes"]
["France","Nouvelle-Aquitaine","Charente-Maritime","Rochefort",null,"Hôtellerie - restauration - tourisme - loisirs",null,null,"Cuisinier"]
["France","Nouvelle-Aquitaine","Charente-Maritime","Rochefort",null,"Bâtiment",null,null,"Agent de maintenance des bâtiments"]
["France","Nouvelle-Aquitaine","Charente-Maritime","Rochefort",null,"Industrie",null,null,"Constructeur aménageur nautique bois et composites"]
["France","Nouvelle-Aquitaine","Charente-Maritime","Rochefort",null,"Fonctions supports de l'entreprise",null,null,"Comptable assistant"]
["France","Nouvelle-Aquitaine","Charente-Maritime","Rochefort",null,"Services aux entreprises et à la personne",null,null,"Assistant de vie aux familles"]
["France","Nouvelle-Aquitaine","Charente-Maritime","Rochefort",null,"Services aux entreprises et à la personne",null,null,"Agent de propreté et d'hygiène"]
["France","Nouvelle-Aquitaine","Charente-Maritime","Rochefort",null,"Fonctions supports de l'entreprise",null,null,"Secrétaire comptable"]
["France","Nouvelle-Aquitaine","Charente-Maritime","Rochefort",null,"Insertion et de la médiation",null,null,"Conseiller en insertion professionnelle"]
["France","Nouvelle-Aquitaine","Charente-Maritime","Rochefort",null,"Bâtiment",null,null,"Electricien d'équipement du bâtiment"]
["France","Nouvelle-Aquitaine","Charente-Maritime","Rochefort",null,"Réseaux - Télécommunications - Informatique - Numérique",null,null,"Technicien d'assistance en informatique"]
["France","Nouvelle-Aquitaine","Charente-Maritime","Rochefort",null,"Commerce - vente - distribution",null,null,"Vendeur-conseil en magasin"]
["France","Nouvelle-Aquitaine","Charente-Maritime","Rochefort",null,"Fonctions supports de l'entreprise",null,null,"Gestionnaire de paie"]
["France","Nouvelle-Aquitaine","Charente-Maritime","Rochefort",null,"Réseaux - Télécommunications - Informatique - Numérique",null,null,"Développeur web et web mobile"]
["France","Nouvelle-Aquitaine","Charente-Maritime","Rochefort",null,"Artisanat d'art",null,null,"Piqueur en maroquinerie"]
["France","Nouvelle-Aquitaine","Charente-Maritime","Rochefort",null,"Réseaux - Télécommunications - Informatique - Numérique",null,null,"Technicien supérieur systèmes et réseaux"]
["France","Nouvelle-Aquitaine","Charente-Maritime","Rochefort",null,"Réseaux - Télécommunications - Informatique - Numérique",null,null,"Administrateur d’infrastructures sécurisées"]
["France","Nouvelle-Aquitaine","Charente-Maritime","Rochefort",null,"Services aux entreprises et à la personne",null,null,"Agent de sûreté et de sécurité privée"]
["France","Nouvelle-Aquitaine","Charente-Maritime","Rochefort",null,"Services aux entreprises et à la personne",null,null,"Agent de service médico-social"]
["France","Nouvelle-Aquitaine","Charente-Maritime","Rochefort",null,"Bâtiment",null,null,"Carreleur-chapiste"]
["France","Nouvelle-Aquitaine","Vienne","Vigeant",null,"Bâtiment",null,null,"Peintre en bâtiment"]
["France","Nouvelle-Aquitaine","Vienne","Vigeant",null,"Commerce - vente - distribution",null,null,"Assistant manager d’unité marchande"]
["France","Nouvelle-Aquitaine","Vienne","Vigeant",null,"Bâtiment",null,null,"Installateur en thermique et sanitaire"]
["France","Nouvelle-Aquitaine","Vienne","Vigeant",null,"Bâtiment",null,null,"Plaquiste-plâtrier"]
["France","Nouvelle-Aquitaine","Vienne","Vigeant",null,"Bâtiment",null,null,"Monteur de réseaux électriques aéro-souterrains"]
["France","Nouvelle-Aquitaine","Vienne","Vigeant",null,"Bâtiment",null,null,"Agent de maintenance des bâtiments"]
["France","Nouvelle-Aquitaine","Vienne","Vigeant",null,"Services aux entreprises et à la personne",null,null,"Assistant de vie aux familles"]
["France","Nouvelle-Aquitaine","Vienne","Vigeant",null,"Services aux entreprises et à la personne",null,null,"Agent de propreté et d'hygiène"]
["France","Nouvelle-Aquitaine","Vienne","Vigeant",null,"Fonctions supports de l'entreprise",null,null,"Secrétaire comptable"]
["France","Nouvelle-Aquitaine","Vienne","Vigeant",null,"Bâtiment",null,null,"Electricien d'équipement du bâtiment"]
["France","Nouvelle-Aquitaine","Vienne","Vigeant",null,"Commerce - vente - distribution",null,null,"Conseiller relation client à distance"]
["France","Nouvelle-Aquitaine","Vienne","Vigeant",null,"Commerce - vente - distribution",null,null,"Vendeur-conseil en magasin"]
["France","Occitanie","Tarn","Albi",null,"Industrie",null,null,"Mécanicien(ne) automobile"]
["France","Occitanie","Tarn","Albi",null,"Bâtiment",null,null,"Peintre en bâtiment"]
["France","Occitanie","Tarn","Albi",null,"Industrie",null,null,"Carrossier réparateur"]
["France","Occitanie","Tarn","Albi",null,"Industrie",null,null,"Peintre en carrosserie"]
["France","Occitanie","Tarn","Albi",null,"Bâtiment",null,null,"Installateur en thermique et sanitaire"]
["France","Occitanie","Tarn","Albi",null,"Commerce - vente - distribution",null,null,"Employé commercial en magasin"]
["France","Occitanie","Tarn","Albi",null,"Bâtiment",null,null,"Maçon"]
["France","Occitanie","Tarn","Albi",null,"Transports - logistique",null,null,"Conducteur livreur sur véhicule utilitaire léger"]
["France","Occitanie","Tarn","Albi",null,"Bâtiment",null,null,"Plaquiste-plâtrier"]
["France","Occitanie","Tarn","Albi",null,"Bâtiment",null,null,"Agent de maintenance des bâtiments"]
["France","Occitanie","Tarn","Albi",null,"Services aux entreprises et à la personne",null,null,"Assistant de vie aux familles"]
["France","Occitanie","Tarn","Albi",null,"Bâtiment",null,null,"Electricien d'équipement du bâtiment"]
["France","Occitanie","Tarn","Albi",null,"Commerce - vente - distribution",null,null,"Conseiller relation client à distance"]
["France","Occitanie","Tarn","Albi",null,"Commerce - vente - distribution",null,null,"Vendeur-conseil en magasin"]
["France","Occitanie","Tarn","Albi",null,"Bâtiment",null,null,"Maçon du bâti ancien"]
["France","Occitanie","Tarn","Albi",null,"Réseaux - Télécommunications - Informatique - Numérique",null,null,"Développeur web et web mobile"]
["France","Occitanie","Tarn","Albi",null,"Industrie",null,null,"Soudeur TIG électrode enrobée"]
["France","Occitanie","Tarn","Albi",null,"Bâtiment",null,null,"Technicien d'installation en équipements de confort climatique"]
["France","Occitanie","Tarn","Albi",null,"Industrie",null,null,"Contrôleur technique de véhicule léger"]
["France","Occitanie","Tarn","Albi",null,"Réseaux - Télécommunications - Informatique - Numérique",null,null,"Technicien supérieur systèmes et réseaux"]
["France","Occitanie","Tarn","Albi",null,"Industrie",null,null,"Soudeur assembleur industriel"]
["France","Occitanie","Tarn","Albi",null,"Bâtiment",null,null,"Carreleur-chapiste"]
["France","Occitanie","Gard","Alès",null,"Commerce - vente - distribution",null,null,"Manager d’unité marchande"]
["France","Occitanie","Gard","Alès",null,"Industrie",null,null,"Tuyauteur industriel"]
["France","Occitanie","Gard","Alès",null,"Commerce - vente - distribution",null,null,"Employé commercial en magasin"]
["France","Occitanie","Gard","Alès",null,"Industrie",null,null,"Electricien d’installation et de maintenance des systèmes automatisés"]
["France","Occitanie","Gard","Alès",null,"Services aux entreprises et à la personne",null,null,"Assistant de vie aux familles"]
["France","Occitanie","Gard","Alès",null,"Industrie",null,null,"Technicien de maintenance industrielle"]
["France","Occitanie","Gard","Alès",null,"Commerce - vente - distribution",null,null,"Vendeur-conseil en magasin"]
["France","Occitanie","Gard","Alès",null,"Industrie",null,null,"Opérateur régleur en usinage assisté par ordinateur"]
["France","Occitanie","Gard","Alès",null,"Industrie",null,null,"Agent de fabrication et montage en chaudronnerie"]
["France","Occitanie","Gard","Alès",null,"Industrie",null,null,"Fraiseur en réalisation de pièces mécaniques"]
["France","Occitanie","Gard","Alès",null,"Industrie",null,null,"Soudeur TIG électrode enrobée"]
["France","Occitanie","Gard","Alès",null,"Industrie",null,null,"Soudeur assembleur industriel"]
["France","Occitanie","Gard","Alès",null,"Services aux entreprises et à la personne",null,null,"Agent de service médico-social"]
["France","Occitanie","Gard","Alès",null,"Services aux entreprises et à la personne",null,null,"Responsable-coordonnateur services au domicile"]
["France","Occitanie","Hérault","Béziers",null,"Bâtiment",null,null,"Monteur dépanneur frigoriste"]
["France","Occitanie","Hérault","Béziers",null,"Bâtiment",null,null,"Peintre en bâtiment"]
["France","Occitanie","Hérault","Béziers",null,"Bâtiment",null,null,"Technicien supérieur d'études en génie climatique"]
["France","Occitanie","Hérault","Béziers",null,"Bâtiment",null,null,"Technicien d'intervention en froid commercial et climatisation"]
["France","Occitanie","Hérault","Béziers",null,"Commerce - vente - distribution",null,null,"Employé commercial en magasin"]
["France","Occitanie","Hérault","Béziers",null,"Bâtiment",null,null,"Maçon"]
["France","Occitanie","Hérault","Béziers",null,"Bâtiment",null,null,"Plaquiste-plâtrier"]
["France","Occitanie","Hérault","Béziers",null,"Bâtiment",null,null,"Agent de maintenance des bâtiments"]
["France","Occitanie","Hérault","Béziers",null,"Fonctions supports de l'entreprise",null,null,"Secrétaire assistant"]
["France","Occitanie","Hérault","Béziers",null,"Fonctions supports de l'entreprise",null,null,"Comptable assistant"]
["France","Occitanie","Hérault","Béziers",null,"Services aux entreprises et à la personne",null,null,"Assistant de vie aux familles"]
["France","Occitanie","Hérault","Béziers",null,"Services aux entreprises et à la personne",null,null,"Agent de propreté et d'hygiène"]
["France","Occitanie","Hérault","Béziers",null,"Industrie",null,null,"Technicien de maintenance industrielle"]
["France","Occitanie","Hérault","Béziers",null,"Bâtiment",null,null,"Technicien d'équipement et de maintenance de piscines"]
["France","Occitanie","Hérault","Béziers",null,"Bâtiment",null,null,"Electricien d'équipement du bâtiment"]
["France","Occitanie","Hérault","Béziers",null,"Bâtiment",null,null,"Technicien du bâtiment communicant et connecté"]
["France","Occitanie","Hérault","Béziers",null,"Bâtiment",null,null,"Monteur dépanneur en climatisation"]
["France","Occitanie","Hérault","Béziers",null,"Hôtellerie - restauration - tourisme - loisirs",null,null,"Chargé d’accueil touristique et de loisirs"]
["France","Occitanie","Hérault","Béziers",null,"Services aux entreprises et à la personne",null,null,"Agent de service médico-social"]
["France","Occitanie","Aude","Carcassonne",null,"Travaux publics",null,null,"Maçon en voirie et réseaux divers"]
["France","Occitanie","Aude","Carcassonne",null,"Bâtiment",null,null,"Installateur en thermique et sanitaire"]
["France","Occitanie","Aude","Carcassonne",null,"Bâtiment",null,null,"Maçon"]
["France","Occitanie","Aude","Carcassonne",null,"Bâtiment",null,null,"Menuisier agenceur"]
["France","Occitanie","Aude","Carcassonne",null,"Transports - logistique",null,null,"Conducteur livreur sur véhicule utilitaire léger"]
["France","Occitanie","Aude","Carcassonne",null,"Commerce - vente - distribution",null,null,"Négociateur technico-commercial"]
["France","Occitanie","Aude","Carcassonne",null,"Bâtiment",null,null,"Agent de maintenance des bâtiments"]
["France","Occitanie","Aude","Carcassonne",null,"Bâtiment",null,null,"Electricien d'équipement du bâtiment"]
["France","Occitanie","Aude","Carcassonne",null,"Commerce - vente - distribution",null,null,"Vendeur-conseil en magasin"]
["France","Occitanie","Aude","Carcassonne",null,"Bâtiment",null,null,"Maçon du bâti ancien"]
["France","Occitanie","Aude","Carcassonne",null,"Bâtiment",null,null,"Menuisier poseur-installateur"]
["France","Occitanie","Ariège","Foix",null,"Services aux entreprises et à la personne",null,null,"Assistant de vie aux familles"]
["France","Occitanie","Tarn-et-Garonne","Montauban",null,"Bâtiment",null,null,"Peintre en bâtiment"]
["France","Occitanie","Tarn-et-Garonne","Montauban",null,"Travaux publics",null,null,"Maçon en voirie et réseaux divers"]
["France","Occitanie","Tarn-et-Garonne","Montauban",null,"Bâtiment",null,null,"Installateur en thermique et sanitaire"]
["France","Occitanie","Tarn-et-Garonne","Montauban",null,"Bâtiment",null,null,"Technicien de maintenance CVC"]
["France","Occitanie","Tarn-et-Garonne","Montauban",null,"Bâtiment",null,null,"Plaquiste-plâtrier"]
["France","Occitanie","Tarn-et-Garonne","Montauban",null,"Bâtiment",null,null,"Monteur de réseaux électriques aéro-souterrains"]
["France","Occitanie","Tarn-et-Garonne","Montauban",null,"Travaux publics",null,null,"Monteur de réseaux électriques aéro-souterrains"]
["France","Occitanie","Tarn-et-Garonne","Montauban",null,"Bâtiment",null,null,"Agent de maintenance des bâtiments"]
["France","Occitanie","Tarn-et-Garonne","Montauban",null,"Services aux entreprises et à la personne",null,null,"Assistant de vie aux familles"]
["France","Occitanie","Tarn-et-Garonne","Montauban",null,"Bâtiment",null,null,"Electricien d'équipement du bâtiment"]
["France","Occitanie","Tarn-et-Garonne","Montauban",null,"Transports - logistique",null,null,"Préparateur de commandes en entrepôt"]
["France","Occitanie","Tarn-et-Garonne","Montauban",null,"Transports - logistique",null,null,"Cariste d'entrepôt"]
["France","Occitanie","Tarn-et-Garonne","Montauban",null,"Réseaux - Télécommunications - Informatique - Numérique",null,null,"Technicien d'assistance en informatique"]
["France","Occitanie","Tarn-et-Garonne","Montauban",null,"Bâtiment",null,null,"Monteur dépanneur en climatisation"]
["France","Occitanie","Tarn-et-Garonne","Montauban",null,"Bâtiment",null,null,"Technicien d'installation en équipements de confort climatique"]
["France","Occitanie","Tarn-et-Garonne","Montauban",null,"Réseaux - Télécommunications - Informatique - Numérique",null,null,"Technicien supérieur systèmes et réseaux"]
["France","Occitanie","Hérault","Montpellier St Jean",null,"Industrie",null,null,"Mécanicien réparateur de motocycles"]
["France","Occitanie","Hérault","Montpellier St Jean",null,"Industrie",null,null,"Carrossier réparateur"]
["France","Occitanie","Hérault","Montpellier St Jean",null,"Bâtiment",null,null,"Maçon en voirie et réseaux divers"]
["France","Occitanie","Hérault","Montpellier St Jean",null,"Travaux publics",null,null,"Maçon en voirie et réseaux divers"]
["France","Occitanie","Hérault","Montpellier St Jean",null,"Fonctions supports de l'entreprise",null,null,"Gestionnaire comptable et fiscal"]
["France","Occitanie","Hérault","Montpellier St Jean",null,"Commerce - vente - distribution",null,null,"Employé commercial en magasin"]
["France","Occitanie","Hérault","Montpellier St Jean",null,"Industrie",null,null,"Mécanicien(ne) de maintenance automobile"]
["France","Occitanie","Hérault","Montpellier St Jean",null,"Transports - logistique",null,null,"Conducteur livreur sur véhicule utilitaire léger"]
["France","Occitanie","Hérault","Montpellier St Jean",null,"Commerce - vente - distribution",null,null,"Employé technicien-vendeur en matériel de sport"]
["France","Occitanie","Hérault","Montpellier St Jean",null,"Commerce - vente - distribution",null,null,"Négociateur technico-commercial"]
["France","Occitanie","Hérault","Montpellier St Jean",null,"Fonctions supports de l'entreprise",null,null,"Formateur professionnel d'adultes"]
["France","Occitanie","Hérault","Montpellier St Jean",null,"Fonctions supports de l'entreprise",null,null,"Secrétaire assistant"]
["France","Occitanie","Hérault","Montpellier St Jean",null,"Fonctions supports de l'entreprise",null,null,"Comptable assistant"]
["France","Occitanie","Hérault","Montpellier St Jean",null,"Fonctions supports de l'entreprise",null,null,"Secrétaire comptable"]
["France","Occitanie","Hérault","Montpellier St Jean",null,"Insertion et de la médiation",null,null,"Conseiller en insertion professionnelle"]
["France","Occitanie","Hérault","Montpellier St Jean",null,"Réseaux - Télécommunications - Informatique - Numérique",null,null,"Installateur de réseaux de télécommunications"]
["France","Occitanie","Hérault","Montpellier St Jean",null,"Industrie",null,null,"Technicien(ne) électromécanicien(ne) automobile"]
["France","Occitanie","Hérault","Montpellier St Jean",null,"Commerce - vente - distribution",null,null,"Vendeur-conseil en magasin"]
["France","Occitanie","Hérault","Montpellier St Jean",null,"Fonctions supports de l'entreprise",null,null,"Gestionnaire de paie"]
["France","Occitanie","Hérault","Montpellier St Jean",null,"Réseaux - Télécommunications - Informatique - Numérique",null,null,"Développeur web et web mobile"]
["France","Occitanie","Hérault","Montpellier St Jean",null,"Réseaux - Télécommunications - Informatique - Numérique",null,null,"Concepteur développeur d’applications"]
["France","Occitanie","Hérault","Montpellier St Jean",null,"Fonctions supports de l'entreprise",null,null,"Assistant ressources humaines"]
["France","Occitanie","Hérault","Montpellier St Jean",null,"Fonctions supports de l'entreprise",null,null,"Assistant de direction"]
["France","Occitanie","Hérault","Montpellier St Jean",null,"Industrie",null,null,"Soudeur TIG électrode enrobée"]
["France","Occitanie","Hérault","Montpellier St Jean",null,"Fonctions supports de l'entreprise",null,null,"Employé administratif et d’accueil"]
["France","Occitanie","Hérault","Montpellier St Jean",null,"Réseaux - Télécommunications - Informatique - Numérique",null,null,"Technicien supérieur systèmes et réseaux"]
["France","Occitanie","Hérault","Montpellier St Jean",null,"Réseaux - Télécommunications - Informatique - Numérique",null,null,"Administrateur d’infrastructures sécurisées"]
["France","Occitanie","Hérault","Montpellier St Jean",null,"Industrie",null,null,"Soudeur assembleur industriel"]
["France","Occitanie","Gard","Nîmes",null,"Bâtiment",null,null,"Peintre en bâtiment"]
["France","Occitanie","Gard","Nîmes",null,"Bâtiment",null,null,"Maçon en voirie et réseaux divers"]
["France","Occitanie","Gard","Nîmes",null,"Fonctions supports de l'entreprise",null,null,"Gestionnaire comptable et fiscal"]
["France","Occitanie","Gard","Nîmes",null,"Bâtiment",null,null,"Installateur en thermique et sanitaire"]
["France","Occitanie","Gard","Nîmes",null,"Bâtiment",null,null,"Maçon"]
["France","Occitanie","Gard","Nîmes",null,"Transports - logistique",null,null,"Conducteur livreur sur véhicule utilitaire léger"]
["France","Occitanie","Gard","Nîmes",null,"Bâtiment",null,null,"Plaquiste-plâtrier"]
["France","Occitanie","Gard","Nîmes",null,"Bâtiment",null,null,"Agent de maintenance des bâtiments"]
["France","Occitanie","Gard","Nîmes",null,"Fonctions supports de l'entreprise",null,null,"Secrétaire assistant"]
["France","Occitanie","Gard","Nîmes",null,"Fonctions supports de l'entreprise",null,null,"Comptable assistant"]
["France","Occitanie","Gard","Nîmes",null,"Services aux entreprises et à la personne",null,null,"Assistant de vie aux familles"]
["France","Occitanie","Gard","Nîmes",null,"Fonctions supports de l'entreprise",null,null,"Secrétaire comptable"]
["France","Occitanie","Gard","Nîmes",null,"Travaux publics",null,null,"Canalisateur"]
["France","Occitanie","Gard","Nîmes",null,"Bâtiment",null,null,"Electricien d'équipement du bâtiment"]
["France","Occitanie","Gard","Nîmes",null,"Transports - logistique",null,null,"Préparateur de commandes en entrepôt"]
["France","Occitanie","Gard","Nîmes",null,"Transports - logistique",null,null,"Cariste d'entrepôt"]
["France","Occitanie","Gard","Nîmes",null,"Bâtiment",null,null,"Agent de maintenance d'équipements de confort climatique"]
["France","Occitanie","Gard","Nîmes",null,"Bâtiment",null,null,"Technicien de maintenance d'équipements de confort climatique"]
["France","Occitanie","Gard","Nîmes",null,"Bâtiment",null,null,"Chef de chantier gros oeuvre"]
["France","Occitanie","Gard","Nîmes",null,"Fonctions supports de l'entreprise",null,null,"Gestionnaire de paie"]
["France","Occitanie","Gard","Nîmes",null,"Bâtiment",null,null,"Maçon du bâti ancien"]
["France","Occitanie","Gard","Nîmes",null,"Bâtiment",null,null,"Monteur dépanneur en climatisation"]
["France","Occitanie","Gard","Nîmes",null,"Fonctions supports de l'entreprise",null,null,"Assistant ressources humaines"]
["France","Occitanie","Gard","Nîmes",null,"Bâtiment",null,null,"Technicien d'études du bâtiment en dessin de projet"]
["France","Occitanie","Gard","Nîmes",null,"Bâtiment",null,null,"Technicien d'installation en équipements de confort climatique"]
["France","Occitanie","Gard","Nîmes",null,"Bâtiment",null,null,"Coffreur Bancheur"]
["France","Occitanie","Gard","Nîmes",null,"Fonctions supports de l'entreprise",null,null,"Assistant immobilier"]
["France","Occitanie","Ariège","Pamiers",null,"Bâtiment",null,null,"Peintre en bâtiment"]
["France","Occitanie","Ariège","Pamiers",null,"Bâtiment",null,null,"Maçon"]
["France","Occitanie","Ariège","Pamiers",null,"Bâtiment",null,null,"Plaquiste-plâtrier"]
["France","Occitanie","Ariège","Pamiers",null,"Bâtiment",null,null,"Agent de maintenance des bâtiments"]
["France","Occitanie","Pyrénées-Orientales","Perpignan Rivesaltes",null,"Fonctions supports de l'entreprise",null,null,"Secrétaire assistant médico-social"]
["France","Occitanie","Pyrénées-Orientales","Perpignan Rivesaltes",null,"Bâtiment",null,null,"Maçon en voirie et réseaux divers"]
["France","Occitanie","Pyrénées-Orientales","Perpignan Rivesaltes",null,"Bâtiment",null,null,"Installateur en thermique et sanitaire"]
["France","Occitanie","Pyrénées-Orientales","Perpignan Rivesaltes",null,"Hôtellerie - restauration - tourisme - loisirs",null,null,"Agent(e) de restauration"]
["France","Occitanie","Pyrénées-Orientales","Perpignan Rivesaltes",null,"Bâtiment",null,null,"Maçon"]
["France","Occitanie","Pyrénées-Orientales","Perpignan Rivesaltes",null,"Transports - logistique",null,null,"Conducteur livreur sur véhicule utilitaire léger"]
["France","Occitanie","Pyrénées-Orientales","Perpignan Rivesaltes",null,"Bâtiment",null,null,"Plaquiste-plâtrier"]
["France","Occitanie","Pyrénées-Orientales","Perpignan Rivesaltes",null,"Commerce - vente - distribution",null,null,"Négociateur technico-commercial"]
["France","Occitanie","Pyrénées-Orientales","Perpignan Rivesaltes",null,"Fonctions supports de l'entreprise",null,null,"Formateur professionnel d'adultes"]
["France","Occitanie","Pyrénées-Orientales","Perpignan Rivesaltes",null,"Hôtellerie - restauration - tourisme - loisirs",null,null,"Cuisinier"]
["France","Occitanie","Pyrénées-Orientales","Perpignan Rivesaltes",null,"Bâtiment",null,null,"Agent de maintenance des bâtiments"]
["France","Occitanie","Pyrénées-Orientales","Perpignan Rivesaltes",null,"Fonctions supports de l'entreprise",null,null,"Secrétaire assistant"]
["France","Occitanie","Pyrénées-Orientales","Perpignan Rivesaltes",null,"Services aux entreprises et à la personne",null,null,"Assistant de vie aux familles"]
["France","Occitanie","Pyrénées-Orientales","Perpignan Rivesaltes",null,"Fonctions supports de l'entreprise",null,null,"Secrétaire comptable"]
["France","Occitanie","Pyrénées-Orientales","Perpignan Rivesaltes",null,"Insertion et de la médiation",null,null,"Conseiller en insertion professionnelle"]
["France","Occitanie","Pyrénées-Orientales","Perpignan Rivesaltes",null,"Bâtiment",null,null,"Electricien d'équipement du bâtiment"]
["France","Occitanie","Pyrénées-Orientales","Perpignan Rivesaltes",null,"Insertion et de la médiation",null,null,"Médiateur social accès aux droits et services"]
["France","Occitanie","Pyrénées-Orientales","Perpignan Rivesaltes",null,"Bâtiment",null,null,"Constructeur bois"]
["France","Occitanie","Pyrénées-Orientales","Perpignan Rivesaltes",null,"Bâtiment",null,null,"Technicien d'études du bâtiment en dessin de projet"]
["France","Occitanie","Pyrénées-Orientales","Perpignan Rivesaltes",null,"Fonctions supports de l'entreprise",null,null,"Employé administratif et d’accueil"]
["France","Occitanie","Pyrénées-Orientales","Perpignan Rivesaltes",null,"Bâtiment",null,null,"Technicien d'installation en équipements de confort climatique"]
["France","Occitanie","Pyrénées-Orientales","Perpignan Rivesaltes",null,"Bâtiment",null,null,"Coffreur Bancheur"]
["France","Occitanie","Pyrénées-Orientales","Perpignan Rivesaltes",null,"Services aux entreprises et à la personne",null,null,"Responsable d’espace de médiation numérique"]
["France","Occitanie","Pyrénées-Orientales","Perpignan Rivesaltes",null,"Services aux entreprises et à la personne",null,null,"Agent de service médico-social"]
["France","Occitanie","Pyrénées-Orientales","Perpignan Rivesaltes",null,"Bâtiment",null,null,"Carreleur-chapiste"]
["France","Occitanie","Aveyron","Rodez",null,"Bâtiment",null,null,"Peintre en bâtiment"]
["France","Occitanie","Aveyron","Rodez",null,"Artisanat d'art",null,null,"Sellier garnisseur"]
["France","Occitanie","Aveyron","Rodez",null,"Bâtiment",null,null,"Installateur en thermique et sanitaire"]
["France","Occitanie","Aveyron","Rodez",null,"Bâtiment",null,null,"Plaquiste-plâtrier"]
["France","Occitanie","Aveyron","Rodez",null,"Bâtiment",null,null,"Agent de maintenance des bâtiments"]
["France","Occitanie","Aveyron","Rodez",null,"Fonctions supports de l'entreprise",null,null,"Comptable assistant"]
["France","Occitanie","Aveyron","Rodez",null,"Services aux entreprises et à la personne",null,null,"Assistant de vie aux familles"]
["France","Occitanie","Aveyron","Rodez",null,"Fonctions supports de l'entreprise",null,null,"Secrétaire comptable"]
["France","Occitanie","Aveyron","Rodez",null,"Bâtiment",null,null,"Electricien d'équipement du bâtiment"]
["France","Occitanie","Aveyron","Rodez",null,"Fonctions supports de l'entreprise",null,null,"Gestionnaire de paie"]
["France","Occitanie","Aveyron","Rodez",null,"Réseaux - Télécommunications - Informatique - Numérique",null,null,"Développeur web et web mobile"]
["France","Occitanie","Aveyron","Rodez",null,"Industrie",null,null,"Conducteur d'équipements agroalimentaires"]
["France","Occitanie","Aveyron","Rodez",null,"Réseaux - Télécommunications - Informatique - Numérique",null,null,"Technicien supérieur systèmes et réseaux"]
["France","Occitanie","Lozère","Saint Chély d'Apcher",null,"Services aux entreprises et à la personne",null,null,"Agent de service médico-social"]
["France","Occitanie","Hautes-Pyrénées","Tarbes",null,"Bâtiment",null,null,"Peintre en bâtiment"]
["France","Occitanie","Hautes-Pyrénées","Tarbes",null,"Bâtiment",null,null,"Couvreur-zingueur"]
["France","Occitanie","Hautes-Pyrénées","Tarbes",null,"Bâtiment",null,null,"Installateur en thermique et sanitaire"]
["France","Occitanie","Hautes-Pyrénées","Tarbes",null,"Bâtiment",null,null,"Maçon"]
["France","Occitanie","Hautes-Pyrénées","Tarbes",null,"Transports - logistique",null,null,"Conducteur livreur sur véhicule utilitaire léger"]
["France","Occitanie","Hautes-Pyrénées","Tarbes",null,"Bâtiment",null,null,"Plaquiste-plâtrier"]
["France","Occitanie","Hautes-Pyrénées","Tarbes",null,"Bâtiment",null,null,"Agent de maintenance des bâtiments"]
["France","Occitanie","Hautes-Pyrénées","Tarbes",null,"Bâtiment",null,null,"Technicien d'intervention en froid et équipements de cuisines professionnelles"]
["France","Occitanie","Hautes-Pyrénées","Tarbes",null,"Bâtiment",null,null,"Electricien d'équipement du bâtiment"]
["France","Occitanie","Hautes-Pyrénées","Tarbes",null,"Bâtiment",null,null,"Monteur dépanneur en climatisation"]
["France","Occitanie","Hautes-Pyrénées","Tarbes",null,"Bâtiment",null,null,"Charpentier bois"]
["France","Occitanie","Hautes-Pyrénées","Tarbes",null,"Bâtiment",null,null,"Constructeur bois"]
["France","Occitanie","Hautes-Pyrénées","Tarbes",null,"Bâtiment",null,null,"Menuisier poseur-installateur"]
["France","Occitanie","Haute-Garonne","Toulouse Balma",null,"Fonctions supports de l'entreprise",null,null,"Secrétaire assistant médico-social"]
["France","Occitanie","Haute-Garonne","Toulouse Balma",null,"Fonctions supports de l'entreprise",null,null,"Gestionnaire comptable et fiscal"]
["France","Occitanie","Haute-Garonne","Toulouse Balma",null,"Hôtellerie - restauration - tourisme - loisirs",null,null,"Agent(e) de restauration"]
["France","Occitanie","Haute-Garonne","Toulouse Balma",null,"Industrie",null,null,"Conducteur d'installation et de machines automatisées"]
["France","Occitanie","Haute-Garonne","Toulouse Balma",null,"Transports - logistique",null,null,"Conducteur livreur sur véhicule utilitaire léger"]
["France","Occitanie","Haute-Garonne","Toulouse Balma",null,"Commerce - vente - distribution",null,null,"Négociateur technico-commercial"]
["France","Occitanie","Haute-Garonne","Toulouse Balma",null,"Fonctions supports de l'entreprise",null,null,"Formateur professionnel d'adultes"]
["France","Occitanie","Haute-Garonne","Toulouse Balma",null,"Fonctions supports de l'entreprise",null,null,"Secrétaire assistant"]
["France","Occitanie","Haute-Garonne","Toulouse Balma",null,"Fonctions supports de l'entreprise",null,null,"Comptable assistant"]
["France","Occitanie","Haute-Garonne","Toulouse Balma",null,"Fonctions supports de l'entreprise",null,null,"Secrétaire comptable"]
["France","Occitanie","Haute-Garonne","Toulouse Balma",null,"Insertion et de la médiation",null,null,"Conseiller en insertion professionnelle"]
["France","Occitanie","Haute-Garonne","Toulouse Balma",null,"Insertion et de la médiation",null,null,"Médiateur social accès aux droits et services"]
["France","Occitanie","Haute-Garonne","Toulouse Balma",null,"Commerce - vente - distribution",null,null,"Vendeur-conseil en magasin"]
["France","Occitanie","Haute-Garonne","Toulouse Balma",null,"Commerce - vente - distribution",null,null,"Assistant import-export"]
["France","Occitanie","Haute-Garonne","Toulouse Balma",null,"Fonctions supports de l'entreprise",null,null,"Gestionnaire de paie"]
["France","Occitanie","Haute-Garonne","Toulouse Balma",null,"Réseaux - Télécommunications - Informatique - Numérique",null,null,"Développeur web et web mobile"]
["France","Occitanie","Haute-Garonne","Toulouse Balma",null,"Réseaux - Télécommunications - Informatique - Numérique",null,null,"Concepteur développeur d’applications"]
["France","Occitanie","Haute-Garonne","Toulouse Balma",null,"Fonctions supports de l'entreprise",null,null,"Assistant ressources humaines"]
["France","Occitanie","Haute-Garonne","Toulouse Balma",null,"Industrie",null,null,"Soudeur TIG électrode enrobée"]
["France","Occitanie","Haute-Garonne","Toulouse Balma",null,"Fonctions supports de l'entreprise",null,null,"Employé administratif et d’accueil"]
["France","Occitanie","Haute-Garonne","Toulouse Balma",null,"Industrie",null,null,"Soudeur assembleur industriel"]
["France","Occitanie","Haute-Garonne","Toulouse Balma",null,"Industrie",null,null,"Technicien supérieur en fabrication additive"]
["France","Occitanie","Haute-Garonne","Toulouse Palays",null,"Travaux publics",null,null,"Conducteur de grue à tour"]
["France","Occitanie","Haute-Garonne","Toulouse Palays",null,"Bâtiment",null,null,"Peintre en bâtiment"]
["France","Occitanie","Haute-Garonne","Toulouse Palays",null,"Bâtiment",null,null,"Maçon en voirie et réseaux divers"]
["France","Occitanie","Haute-Garonne","Toulouse Palays",null,"Travaux publics",null,null,"Maçon en voirie et réseaux divers"]
["France","Occitanie","Haute-Garonne","Toulouse Palays",null,"Bâtiment",null,null,"Technicien d'études en construction bois"]
["France","Occitanie","Haute-Garonne","Toulouse Palays",null,"Travaux publics",null,null,"Chef de chantier travaux publics routes et canalisations"]
["France","Occitanie","Haute-Garonne","Toulouse Palays",null,"Bâtiment",null,null,"Installateur en thermique et sanitaire"]
["France","Occitanie","Haute-Garonne","Toulouse Palays",null,"Hôtellerie - restauration - tourisme - loisirs",null,null,"Agent(e) de restauration"]
["France","Occitanie","Haute-Garonne","Toulouse Palays",null,"Travaux publics",null,null,"Conducteur d’engins de chantiers urbains"]
["France","Occitanie","Haute-Garonne","Toulouse Palays",null,"Bâtiment",null,null,"Technicien supérieur du bâtiment option économie de la construction"]
["France","Occitanie","Haute-Garonne","Toulouse Palays",null,"Bâtiment",null,null,"Technicien de maintenance CVC"]
["France","Occitanie","Haute-Garonne","Toulouse Palays",null,"Services aux entreprises et à la personne",null,null,"Technicien de maintenance et de travaux en systèmes de sécurité incendie"]
["France","Occitanie","Haute-Garonne","Toulouse Palays",null,"Bâtiment",null,null,"Plaquiste-plâtrier"]
["France","Occitanie","Haute-Garonne","Toulouse Palays",null,"Bâtiment",null,null,"Agent de maintenance des bâtiments"]
["France","Occitanie","Haute-Garonne","Toulouse Palays",null,"Services aux entreprises et à la personne",null,null,"Assistant de vie aux familles"]
["France","Occitanie","Haute-Garonne","Toulouse Palays",null,"Bâtiment",null,null,"Electricien d'équipement du bâtiment"]
["France","Occitanie","Haute-Garonne","Toulouse Palays",null,"Bâtiment",null,null,"Agent de maintenance d'équipements de confort climatique"]
["France","Occitanie","Haute-Garonne","Toulouse Palays",null,"Bâtiment",null,null,"Technicien de maintenance d'équipements de confort climatique"]
["France","Occitanie","Haute-Garonne","Toulouse Palays",null,"Bâtiment",null,null,"Chef de chantier gros oeuvre"]
["France","Occitanie","Haute-Garonne","Toulouse Palays",null,"Bâtiment",null,null,"Monteur dépanneur en climatisation"]
["France","Occitanie","Haute-Garonne","Toulouse Palays",null,"Bâtiment",null,null,"Chargé d'affaires du bâtiment"]
["France","Occitanie","Haute-Garonne","Toulouse Palays",null,"Bâtiment",null,null,"Chargé d'affaires en rénovation énergétique du bâtiment"]
["France","Occitanie","Haute-Garonne","Toulouse Palays",null,"Bâtiment",null,null,"Technicien d'études du bâtiment en dessin de projet"]
["France","Occitanie","Haute-Garonne","Toulouse Palays",null,"Bâtiment",null,null,"Coffreur Bancheur"]
["France","Occitanie","Haute-Garonne","Toulouse Palays",null,"Bâtiment",null,null,"Conducteur de travaux du bâtiment et du génie civil"]
["France","Occitanie","Haute-Garonne","Toulouse Palays",null,"Bâtiment",null,null,"Technicien supérieur du bâtiment option étude de prix"]
["France","Occitanie","Haute-Garonne","Toulouse Palays",null,"Services aux entreprises et à la personne",null,null,"Agent de sûreté et de sécurité privée"]
["France","Occitanie","Haute-Garonne","Toulouse Palays",null,"Bâtiment",null,null,"Technicien métreur du bâtiment"]
["France","Occitanie","Haute-Garonne","Toulouse Palays",null,"Bâtiment",null,null,"Carreleur-chapiste"]
["France","Provence-Alpes-Côte d'Azur","Vaucluse","Avignon Le Pontet",null,"Fonctions supports de l'entreprise",null,null,"Secrétaire assistant médico-social"]
["France","Provence-Alpes-Côte d'Azur","Vaucluse","Avignon Le Pontet",null,"Transports - logistique",null,null,"Technicien supérieur / Technicienne supérieure en méthodes et exploitation logistique"]
["France","Provence-Alpes-Côte d'Azur","Vaucluse","Avignon Le Pontet",null,"Bâtiment",null,null,"Installateur en thermique et sanitaire"]
["France","Provence-Alpes-Côte d'Azur","Vaucluse","Avignon Le Pontet",null,"Industrie",null,null,"Mécanicien(ne) de maintenance automobile"]
["France","Provence-Alpes-Côte d'Azur","Vaucluse","Avignon Le Pontet",null,"Transports - logistique",null,null,"Conducteur livreur sur véhicule utilitaire léger"]
["France","Provence-Alpes-Côte d'Azur","Vaucluse","Avignon Le Pontet",null,"Bâtiment",null,null,"Agent de maintenance des bâtiments"]
["France","Provence-Alpes-Côte d'Azur","Vaucluse","Avignon Le Pontet",null,"Fonctions supports de l'entreprise",null,null,"Secrétaire assistant"]
["France","Provence-Alpes-Côte d'Azur","Vaucluse","Avignon Le Pontet",null,"Fonctions supports de l'entreprise",null,null,"Comptable assistant"]
["France","Provence-Alpes-Côte d'Azur","Vaucluse","Avignon Le Pontet",null,"Services aux entreprises et à la personne",null,null,"Assistant de vie aux familles"]
["France","Provence-Alpes-Côte d'Azur","Vaucluse","Avignon Le Pontet",null,"Fonctions supports de l'entreprise",null,null,"Secrétaire comptable"]
["France","Provence-Alpes-Côte d'Azur","Vaucluse","Avignon Le Pontet",null,"Insertion et de la médiation",null,null,"Conseiller en insertion professionnelle"]
["France","Provence-Alpes-Côte d'Azur","Vaucluse","Avignon Le Pontet",null,"Industrie",null,null,"Technicien(ne) électromécanicien(ne) automobile"]
["France","Provence-Alpes-Côte d'Azur","Vaucluse","Avignon Le Pontet",null,"Transports - logistique",null,null,"Technicien(ne) en logistique d'entreposage"]
["France","Provence-Alpes-Côte d'Azur","Vaucluse","Avignon Le Pontet",null,"Bâtiment",null,null,"Electricien d'équipement du bâtiment"]
["France","Provence-Alpes-Côte d'Azur","Vaucluse","Avignon Le Pontet",null,"Transports - logistique",null,null,"Préparateur de commandes en entrepôt"]
["France","Provence-Alpes-Côte d'Azur","Vaucluse","Avignon Le Pontet",null,"Bâtiment",null,null,"Technicien du bâtiment communicant et connecté"]
["France","Provence-Alpes-Côte d'Azur","Vaucluse","Avignon Le Pontet",null,"Commerce - vente - distribution",null,null,"Vendeur-conseil en magasin"]
["France","Provence-Alpes-Côte d'Azur","Vaucluse","Avignon Le Pontet",null,"Fonctions supports de l'entreprise",null,null,"Gestionnaire de paie"]
["France","Provence-Alpes-Côte d'Azur","Vaucluse","Avignon Le Pontet",null,"Fonctions supports de l'entreprise",null,null,"Assistant ressources humaines"]
["France","Provence-Alpes-Côte d'Azur","Vaucluse","Avignon Le Pontet",null,"Fonctions supports de l'entreprise",null,null,"Employé administratif et d’accueil"]
["France","Provence-Alpes-Côte d'Azur","Vaucluse","Avignon Le Pontet",null,"Bâtiment",null,null,"Technicien d'installation en équipements de confort climatique"]
["France","Provence-Alpes-Côte d'Azur","Vaucluse","Avignon Le Pontet",null,"Services aux entreprises et à la personne",null,null,"Responsable d’espace de médiation numérique"]
["France","Provence-Alpes-Côte d'Azur","Vaucluse","Avignon Le Pontet",null,"Services aux entreprises et à la personne",null,null,"Agent de service médico-social"]
["France","Provence-Alpes-Côte d'Azur","Vaucluse","Avignon Le Pontet",null,"Services aux entreprises et à la personne",null,null,"Responsable-coordonnateur services au domicile"]
["France","Provence-Alpes-Côte d'Azur","Hautes-Alpes","Gap",null,"Bâtiment",null,null,"Couvreur-zingueur"]
["France","Provence-Alpes-Côte d'Azur","Hautes-Alpes","Gap",null,"Bâtiment",null,null,"Installateur en thermique et sanitaire"]
["France","Provence-Alpes-Côte d'Azur","Hautes-Alpes","Gap",null,"Commerce - vente - distribution",null,null,"Employé technicien-vendeur en matériel de sport"]
["France","Provence-Alpes-Côte d'Azur","Hautes-Alpes","Gap",null,"Bâtiment",null,null,"Agent de maintenance des bâtiments"]
["France","Provence-Alpes-Côte d'Azur","Hautes-Alpes","Gap",null,"Insertion et de la médiation",null,null,"Conseiller en insertion professionnelle"]
["France","Provence-Alpes-Côte d'Azur","Hautes-Alpes","Gap",null,"Bâtiment",null,null,"Electricien d'équipement du bâtiment"]
["France","Provence-Alpes-Côte d'Azur","Hautes-Alpes","Gap",null,"Bâtiment",null,null,"Charpentier bois"]
["France","Provence-Alpes-Côte d'Azur","Hautes-Alpes","Gap",null,"Bâtiment",null,null,"Constructeur bois"]
["France","Provence-Alpes-Côte d'Azur","Hautes-Alpes","Gap",null,"Bâtiment",null,null,"Chargé d'affaires en rénovation énergétique du bâtiment"]
["France","Provence-Alpes-Côte d'Azur","Bouches-du-Rhône","Istres",null,"Fonctions supports de l'entreprise",null,null,"Secrétaire assistant médico-social"]
["France","Provence-Alpes-Côte d'Azur","Bouches-du-Rhône","Istres",null,"Fonctions supports de l'entreprise",null,null,"Gestionnaire comptable et fiscal"]
["France","Provence-Alpes-Côte d'Azur","Bouches-du-Rhône","Istres",null,"Industrie",null,null,"Tuyauteur industriel"]
["France","Provence-Alpes-Côte d'Azur","Bouches-du-Rhône","Istres",null,"Industrie",null,null,"Conducteur d'installation et de machines automatisées"]
["France","Provence-Alpes-Côte d'Azur","Bouches-du-Rhône","Istres",null,"Industrie",null,null,"Technicien supérieur de maintenance industrielle"]
["France","Provence-Alpes-Côte d'Azur","Bouches-du-Rhône","Istres",null,"Industrie",null,null,"Electromécanicien de maintenance industrielle"]
["France","Provence-Alpes-Côte d'Azur","Bouches-du-Rhône","Istres",null,"Transports - logistique",null,null,"Conducteur livreur sur véhicule utilitaire léger"]
["France","Provence-Alpes-Côte d'Azur","Bouches-du-Rhône","Istres",null,"Fonctions supports de l'entreprise",null,null,"Secrétaire assistant"]
["France","Provence-Alpes-Côte d'Azur","Bouches-du-Rhône","Istres",null,"Fonctions supports de l'entreprise",null,null,"Comptable assistant"]
["France","Provence-Alpes-Côte d'Azur","Bouches-du-Rhône","Istres",null,"Fonctions supports de l'entreprise",null,null,"Secrétaire comptable"]
["France","Provence-Alpes-Côte d'Azur","Bouches-du-Rhône","Istres",null,"Insertion et de la médiation",null,null,"Conseiller en insertion professionnelle"]
["France","Provence-Alpes-Côte d'Azur","Bouches-du-Rhône","Istres",null,"Industrie",null,null,"Technicien de maintenance industrielle"]
["France","Provence-Alpes-Côte d'Azur","Bouches-du-Rhône","Istres",null,"Transports - logistique",null,null,"Préparateur de commandes en entrepôt"]
["France","Provence-Alpes-Côte d'Azur","Bouches-du-Rhône","Istres",null,"Réseaux - Télécommunications - Informatique - Numérique",null,null,"Technicien d'assistance en informatique"]
["France","Provence-Alpes-Côte d'Azur","Bouches-du-Rhône","Istres",null,"Fonctions supports de l'entreprise",null,null,"Gestionnaire de paie"]
["France","Provence-Alpes-Côte d'Azur","Bouches-du-Rhône","Istres",null,"Réseaux - Télécommunications - Informatique - Numérique",null,null,"Développeur web et web mobile"]
["France","Provence-Alpes-Côte d'Azur","Bouches-du-Rhône","Istres",null,"Fonctions supports de l'entreprise",null,null,"Assistant ressources humaines"]
["France","Provence-Alpes-Côte d'Azur","Bouches-du-Rhône","Istres",null,"Industrie",null,null,"Soudeur TIG électrode enrobée"]
["France","Provence-Alpes-Côte d'Azur","Bouches-du-Rhône","Istres",null,"Fonctions supports de l'entreprise",null,null,"Employé administratif et d’accueil"]
["France","Provence-Alpes-Côte d'Azur","Bouches-du-Rhône","Istres",null,"Réseaux - Télécommunications - Informatique - Numérique",null,null,"Technicien supérieur systèmes et réseaux"]
["France","Provence-Alpes-Côte d'Azur","Bouches-du-Rhône","Istres",null,"Industrie",null,null,"Soudeur assembleur industriel"]
["France","Provence-Alpes-Côte d'Azur","Bouches-du-Rhône","Marseille la Treille",null,"Bâtiment",null,null,"Monteur dépanneur frigoriste"]
["France","Provence-Alpes-Côte d'Azur","Bouches-du-Rhône","Marseille la Treille",null,"Bâtiment",null,null,"Peintre en bâtiment"]
["France","Provence-Alpes-Côte d'Azur","Bouches-du-Rhône","Marseille la Treille",null,"Industrie",null,null,"Carrossier réparateur"]
["France","Provence-Alpes-Côte d'Azur","Bouches-du-Rhône","Marseille la Treille",null,"Industrie",null,null,"Technicien d’après-vente en électroménager et audiovisuel à domicile"]
["France","Provence-Alpes-Côte d'Azur","Bouches-du-Rhône","Marseille la Treille",null,"Bâtiment",null,null,"Technicien d'intervention en froid commercial et climatisation"]
["France","Provence-Alpes-Côte d'Azur","Bouches-du-Rhône","Marseille la Treille",null,"Bâtiment",null,null,"Installateur en thermique et sanitaire"]
["France","Provence-Alpes-Côte d'Azur","Bouches-du-Rhône","Marseille la Treille",null,"Industrie",null,null,"Tuyauteur industriel"]
["France","Provence-Alpes-Côte d'Azur","Bouches-du-Rhône","Marseille la Treille",null,"Bâtiment",null,null,"Maçon"]
["France","Provence-Alpes-Côte d'Azur","Bouches-du-Rhône","Marseille la Treille",null,"Industrie",null,null,"Mécanicien(ne) de maintenance automobile"]
["France","Provence-Alpes-Côte d'Azur","Bouches-du-Rhône","Marseille la Treille",null,"Bâtiment",null,null,"Technicien supérieur géomètre topographe option cabinet de géomètre"]
["France","Provence-Alpes-Côte d'Azur","Bouches-du-Rhône","Marseille la Treille",null,"Bâtiment",null,null,"Plaquiste-plâtrier"]
["France","Provence-Alpes-Côte d'Azur","Bouches-du-Rhône","Marseille la Treille",null,"Industrie",null,null,"Technicien de traitement des eaux"]
["France","Provence-Alpes-Côte d'Azur","Bouches-du-Rhône","Marseille la Treille",null,"Bâtiment",null,null,"Agent de maintenance des bâtiments"]
["France","Provence-Alpes-Côte d'Azur","Bouches-du-Rhône","Marseille la Treille",null,"Bâtiment",null,null,"Façadier-peintre"]
["France","Provence-Alpes-Côte d'Azur","Bouches-du-Rhône","Marseille la Treille",null,"Industrie",null,null,"Agent de montage et de câblage en électronique"]
["France","Provence-Alpes-Côte d'Azur","Bouches-du-Rhône","Marseille la Treille",null,"Bâtiment",null,null,"Electricien d'équipement du bâtiment"]
["France","Provence-Alpes-Côte d'Azur","Bouches-du-Rhône","Marseille la Treille",null,"Bâtiment",null,null,"Technicien du bâtiment communicant et connecté"]
["France","Provence-Alpes-Côte d'Azur","Bouches-du-Rhône","Marseille la Treille",null,"Bâtiment",null,null,"Maçon du bâti ancien"]
["France","Provence-Alpes-Côte d'Azur","Bouches-du-Rhône","Marseille la Treille",null,"Bâtiment",null,null,"Monteur dépanneur en climatisation"]
["France","Provence-Alpes-Côte d'Azur","Bouches-du-Rhône","Marseille la Treille",null,"Industrie",null,null,"Soudeur TIG électrode enrobée"]
["France","Provence-Alpes-Côte d'Azur","Bouches-du-Rhône","Marseille la Treille",null,"Industrie",null,null,"Technicien en chaudronnerie"]
["France","Provence-Alpes-Côte d'Azur","Bouches-du-Rhône","Marseille la Treille",null,"Bâtiment",null,null,"Technicien d'installation en équipements de confort climatique"]
["France","Provence-Alpes-Côte d'Azur","Bouches-du-Rhône","Marseille la Treille",null,"Bâtiment",null,null,"Coffreur Bancheur"]
["France","Provence-Alpes-Côte d'Azur","Bouches-du-Rhône","Marseille la Treille",null,"Industrie",null,null,"Contrôleur technique de véhicule léger"]
["France","Provence-Alpes-Côte d'Azur","Bouches-du-Rhône","Marseille Pointe Rouge",null,"Industrie",null,null,"Agent de maintenance en marine de plaisance"]
["France","Provence-Alpes-Côte d'Azur","Bouches-du-Rhône","Marseille Pointe Rouge",null,"Industrie",null,null,"Mécanicien réparateur en marine de plaisance"]
["France","Provence-Alpes-Côte d'Azur","Bouches-du-Rhône","Marseille St Jérôme",null,"Fonctions supports de l'entreprise",null,null,"Secrétaire assistant médico-social"]
["France","Provence-Alpes-Côte d'Azur","Bouches-du-Rhône","Marseille St Jérôme",null,"Fonctions supports de l'entreprise",null,null,"Gestionnaire comptable et fiscal"]
["France","Provence-Alpes-Côte d'Azur","Bouches-du-Rhône","Marseille St Jérôme",null,"Transports - logistique",null,null,"Conducteur livreur sur véhicule utilitaire léger"]
["France","Provence-Alpes-Côte d'Azur","Bouches-du-Rhône","Marseille St Jérôme",null,"Fonctions supports de l'entreprise",null,null,"Formateur professionnel d'adultes"]
["France","Provence-Alpes-Côte d'Azur","Bouches-du-Rhône","Marseille St Jérôme",null,"Fonctions supports de l'entreprise",null,null,"Secrétaire assistant"]
["France","Provence-Alpes-Côte d'Azur","Bouches-du-Rhône","Marseille St Jérôme",null,"Hôtellerie - restauration - tourisme - loisirs",null,null,"Réceptionniste en hôtellerie"]
["France","Provence-Alpes-Côte d'Azur","Bouches-du-Rhône","Marseille St Jérôme",null,"Fonctions supports de l'entreprise",null,null,"Comptable assistant"]
["France","Provence-Alpes-Côte d'Azur","Bouches-du-Rhône","Marseille St Jérôme",null,"Insertion et de la médiation",null,null,"Conseiller en insertion professionnelle"]
["France","Provence-Alpes-Côte d'Azur","Bouches-du-Rhône","Marseille St Jérôme",null,"Insertion et de la médiation",null,null,"Encadrant technique d'insertion"]
["France","Provence-Alpes-Côte d'Azur","Bouches-du-Rhône","Marseille St Jérôme",null,"Commerce - vente - distribution",null,null,"Vendeur-conseil en magasin"]
["France","Provence-Alpes-Côte d'Azur","Bouches-du-Rhône","Marseille St Jérôme",null,"Fonctions supports de l'entreprise",null,null,"Gestionnaire de paie"]
["France","Provence-Alpes-Côte d'Azur","Bouches-du-Rhône","Marseille St Jérôme",null,"Réseaux - Télécommunications - Informatique - Numérique",null,null,"Développeur web et web mobile"]
["France","Provence-Alpes-Côte d'Azur","Bouches-du-Rhône","Marseille St Jérôme",null,"Fonctions supports de l'entreprise",null,null,"Assistant ressources humaines"]
["France","Provence-Alpes-Côte d'Azur","Bouches-du-Rhône","Marseille St Jérôme",null,"Fonctions supports de l'entreprise",null,null,"Assistant de direction"]
["France","Provence-Alpes-Côte d'Azur","Bouches-du-Rhône","Marseille St Jérôme",null,"Fonctions supports de l'entreprise",null,null,"Employé administratif et d’accueil"]
["France","Provence-Alpes-Côte d'Azur","Bouches-du-Rhône","Marseille St Jérôme",null,"Transports - logistique",null,null,"Organisateur de transports aériens ou maritimes de marchandises"]
["France","Provence-Alpes-Côte d'Azur","Bouches-du-Rhône","Marseille St Jérôme",null,"Réseaux - Télécommunications - Informatique - Numérique",null,null,"Technicien supérieur systèmes et réseaux"]
["France","Provence-Alpes-Côte d'Azur","Alpes-Maritimes","Nice",null,"Fonctions supports de l'entreprise",null,null,"Secrétaire assistant médico-social"]
["France","Provence-Alpes-Côte d'Azur","Alpes-Maritimes","Nice",null,"Bâtiment",null,null,"Installateur en thermique et sanitaire"]
["France","Provence-Alpes-Côte d'Azur","Alpes-Maritimes","Nice",null,"Hôtellerie - restauration - tourisme - loisirs",null,null,"Agent(e) de restauration"]
["France","Provence-Alpes-Côte d'Azur","Alpes-Maritimes","Nice",null,"Transports - logistique",null,null,"Conducteur livreur sur véhicule utilitaire léger"]
["France","Provence-Alpes-Côte d'Azur","Alpes-Maritimes","Nice",null,"Fonctions supports de l'entreprise",null,null,"Formateur professionnel d'adultes"]
["France","Provence-Alpes-Côte d'Azur","Alpes-Maritimes","Nice",null,"Bâtiment",null,null,"Agent de maintenance des bâtiments"]
["France","Provence-Alpes-Côte d'Azur","Alpes-Maritimes","Nice",null,"Fonctions supports de l'entreprise",null,null,"Secrétaire assistant"]
["France","Provence-Alpes-Côte d'Azur","Alpes-Maritimes","Nice",null,"Fonctions supports de l'entreprise",null,null,"Comptable assistant"]
["France","Provence-Alpes-Côte d'Azur","Alpes-Maritimes","Nice",null,"Fonctions supports de l'entreprise",null,null,"Secrétaire comptable"]
["France","Provence-Alpes-Côte d'Azur","Alpes-Maritimes","Nice",null,"Insertion et de la médiation",null,null,"Conseiller en insertion professionnelle"]
["France","Provence-Alpes-Côte d'Azur","Alpes-Maritimes","Nice",null,"Bâtiment",null,null,"Electricien d'équipement du bâtiment"]
["France","Provence-Alpes-Côte d'Azur","Alpes-Maritimes","Nice",null,"Fonctions supports de l'entreprise",null,null,"Gestionnaire de paie"]
["France","Provence-Alpes-Côte d'Azur","Alpes-Maritimes","Nice",null,"Bâtiment",null,null,"Monteur dépanneur en climatisation"]
["France","Provence-Alpes-Côte d'Azur","Alpes-Maritimes","Nice",null,"Réseaux - Télécommunications - Informatique - Numérique",null,null,"Concepteur développeur d’applications"]
["France","Provence-Alpes-Côte d'Azur","Alpes-Maritimes","Nice",null,"Bâtiment",null,null,"Chargé d'affaires en rénovation énergétique du bâtiment"]
["France","Provence-Alpes-Côte d'Azur","Alpes-Maritimes","Nice",null,"Fonctions supports de l'entreprise",null,null,"Employé administratif et d’accueil"]
["France","Provence-Alpes-Côte d'Azur","Var","Toulon La Valette",null,"Bâtiment",null,null,"Peintre en bâtiment"]
["France","Provence-Alpes-Côte d'Azur","Var","Toulon La Valette",null,"Bâtiment",null,null,"Maçon en voirie et réseaux divers"]
["France","Provence-Alpes-Côte d'Azur","Var","Toulon La Valette",null,"Fonctions supports de l'entreprise",null,null,"Gestionnaire comptable et fiscal"]
["France","Provence-Alpes-Côte d'Azur","Var","Toulon La Valette",null,"Bâtiment",null,null,"Installateur en thermique et sanitaire"]
["France","Provence-Alpes-Côte d'Azur","Var","Toulon La Valette",null,"Industrie",null,null,"Conducteur d'installation et de machines automatisées"]
["France","Provence-Alpes-Côte d'Azur","Var","Toulon La Valette",null,"Industrie",null,null,"Mécanicien(ne) de maintenance automobile"]
["France","Provence-Alpes-Côte d'Azur","Var","Toulon La Valette",null,"Bâtiment",null,null,"Technicien supérieur du bâtiment option économie de la construction"]
["France","Provence-Alpes-Côte d'Azur","Var","Toulon La Valette",null,"Bâtiment",null,null,"Assistant chef de chantier gros oeuvre"]
["France","Provence-Alpes-Côte d'Azur","Var","Toulon La Valette",null,"Transports - logistique",null,null,"Conducteur livreur sur véhicule utilitaire léger"]
["France","Provence-Alpes-Côte d'Azur","Var","Toulon La Valette",null,"Bâtiment",null,null,"Technicien de maintenance CVC"]
["France","Provence-Alpes-Côte d'Azur","Var","Toulon La Valette",null,"Bâtiment",null,null,"Plaquiste-plâtrier"]
["France","Provence-Alpes-Côte d'Azur","Var","Toulon La Valette",null,"Bâtiment",null,null,"Ferronnier"]
["France","Provence-Alpes-Côte d'Azur","Var","Toulon La Valette",null,"Bâtiment",null,null,"Agent de maintenance des bâtiments"]
["France","Provence-Alpes-Côte d'Azur","Var","Toulon La Valette",null,"Bâtiment",null,null,"Agent de maintenance CVC"]
["France","Provence-Alpes-Côte d'Azur","Var","Toulon La Valette",null,"Fonctions supports de l'entreprise",null,null,"Comptable assistant"]
["France","Provence-Alpes-Côte d'Azur","Var","Toulon La Valette",null,"Services aux entreprises et à la personne",null,null,"Assistant de vie aux familles"]
["France","Provence-Alpes-Côte d'Azur","Var","Toulon La Valette",null,"Fonctions supports de l'entreprise",null,null,"Secrétaire comptable"]
["France","Provence-Alpes-Côte d'Azur","Var","Toulon La Valette",null,"Bâtiment",null,null,"Electricien d'équipement du bâtiment"]
["France","Provence-Alpes-Côte d'Azur","Var","Toulon La Valette",null,"Fonctions supports de l'entreprise",null,null,"Monteur / monteuse audiovisuel"]
["France","Provence-Alpes-Côte d'Azur","Var","Toulon La Valette",null,"Fonctions supports de l'entreprise",null,null,"Gestionnaire de paie"]
["France","Provence-Alpes-Côte d'Azur","Var","Toulon La Valette",null,"Bâtiment",null,null,"Monteur dépanneur en climatisation"]
["France","Provence-Alpes-Côte d'Azur","Var","Toulon La Valette",null,"Bâtiment",null,null,"Technicien d'études du bâtiment en dessin de projet"]
["France","Provence-Alpes-Côte d'Azur","Var","Toulon La Valette",null,"Bâtiment",null,null,"Technicien d'installation en équipements de confort climatique"]
["France","Provence-Alpes-Côte d'Azur","Var","Toulon La Valette",null,"Bâtiment",null,null,"Conducteur de travaux du bâtiment et du génie civil"]
["France","Provence-Alpes-Côte d'Azur","Var","Toulon La Valette",null,"Bâtiment",null,null,"Menuisier poseur-installateur"]
["France","Provence-Alpes-Côte d'Azur","Var","Toulon La Valette",null,"Bâtiment",null,null,"BIM modeleur du bâtiment"]
["France","Provence-Alpes-Côte d'Azur","Var","Toulon La Valette",null,"Industrie",null,null,"Soudeur assembleur industriel"]
["France","Provence-Alpes-Côte d'Azur","Var","Toulon La Valette",null,"Bâtiment",null,null,"Technicien métreur du bâtiment"]
["France","Pays de la Loire","Maine-et-Loire","Angers",null,"Bâtiment",null,null,"Monteur dépanneur frigoriste"]
["France","Pays de la Loire","Maine-et-Loire","Angers",null,"Fonctions supports de l'entreprise",null,null,"Secrétaire assistant médico-social"]
["France","Pays de la Loire","Maine-et-Loire","Angers",null,"Bâtiment",null,null,"Peintre en bâtiment"]
["France","Pays de la Loire","Maine-et-Loire","Angers",null,"Fonctions supports de l'entreprise",null,null,"Gestionnaire comptable et fiscal"]
["France","Pays de la Loire","Maine-et-Loire","Angers",null,"Bâtiment",null,null,"Technicien d'intervention en froid commercial et climatisation"]
["France","Pays de la Loire","Maine-et-Loire","Angers",null,"Bâtiment",null,null,"Installateur en thermique et sanitaire"]
["France","Pays de la Loire","Maine-et-Loire","Angers",null,"Fonctions supports de l'entreprise",null,null,"Secrétaire assistant"]
["France","Pays de la Loire","Maine-et-Loire","Angers",null,"Fonctions supports de l'entreprise",null,null,"Comptable assistant"]
["France","Pays de la Loire","Maine-et-Loire","Angers",null,"Fonctions supports de l'entreprise",null,null,"Secrétaire comptable"]
["France","Pays de la Loire","Maine-et-Loire","Angers",null,"Bâtiment",null,null,"Electricien d'équipement du bâtiment"]
["France","Pays de la Loire","Maine-et-Loire","Angers",null,"Réseaux - Télécommunications - Informatique - Numérique",null,null,"Technicien d'assistance en informatique"]
["France","Pays de la Loire","Maine-et-Loire","Angers",null,"Réseaux - Télécommunications - Informatique - Numérique",null,null,"Technicien réseaux IP"]
["France","Pays de la Loire","Maine-et-Loire","Angers",null,"Bâtiment",null,null,"Monteur dépanneur en climatisation"]
["France","Pays de la Loire","Maine-et-Loire","Angers",null,"Réseaux - Télécommunications - Informatique - Numérique",null,null,"Développeur web et web mobile"]
["France","Pays de la Loire","Maine-et-Loire","Angers",null,"Fonctions supports de l'entreprise",null,null,"Employé administratif et d’accueil"]
["France","Pays de la Loire","Maine-et-Loire","Cholet",null,"Transports - logistique",null,null,"Conducteur du transport routier de marchandises sur tous véhicules"]
["France","Pays de la Loire","Maine-et-Loire","Cholet",null,"Transports - logistique",null,null,"Conducteur du transport routier de marchandises sur porteur"]
["France","Pays de la Loire","Maine-et-Loire","Cholet",null,"Transports - logistique",null,null,"Conducteur livreur sur véhicule utilitaire léger"]
["France","Pays de la Loire","Maine-et-Loire","Cholet",null,"Fonctions supports de l'entreprise",null,null,"Secrétaire assistant"]
["France","Pays de la Loire","Maine-et-Loire","Cholet",null,"Services aux entreprises et à la personne",null,null,"Assistant de vie aux familles"]
["France","Pays de la Loire","Maine-et-Loire","Cholet",null,"Transports - logistique",null,null,"Technicien en logistique d'entreposage"]
["France","Pays de la Loire","Maine-et-Loire","Cholet",null,"Transports - logistique",null,null,"Préparateur de commandes en entrepôt"]
["France","Pays de la Loire","Maine-et-Loire","Cholet",null,"Transports - logistique",null,null,"Agent magasinier"]
["France","Pays de la Loire","Maine-et-Loire","Cholet",null,"Commerce - vente - distribution",null,null,"Vendeur-conseil en magasin"]
["France","Pays de la Loire","Maine-et-Loire","Cholet",null,"Commerce - vente - distribution",null,null,"Assistant commercial"]
["France","Pays de la Loire","Maine-et-Loire","Cholet",null,"Artisanat d'art",null,null,"Piqueur en maroquinerie"]
["France","Pays de la Loire","Maine-et-Loire","Cholet",null,"Fonctions supports de l'entreprise",null,null,"Employé administratif et d’accueil"]
["France","Pays de la Loire","Maine-et-Loire","Cholet",null,"Services aux entreprises et à la personne",null,null,"Agent de service médico-social"]
["France","Pays de la Loire","Maine-et-Loire","Doué la Fontaine",null,"Industrie",null,null,"Mécanicien(ne) Réparateur(trice) de Matériels de Chantier et de Manutention"]
["France","Pays de la Loire","Maine-et-Loire","Doué la Fontaine",null,"Bâtiment",null,null,"Maçon en voirie et réseaux divers"]
["France","Pays de la Loire","Maine-et-Loire","Doué la Fontaine",null,"Travaux publics",null,null,"Maçon en voirie et réseaux divers"]
["France","Pays de la Loire","Maine-et-Loire","Doué la Fontaine",null,"Industrie",null,null,"Technicien de maintenance d'engins et de matériels de chantier et de manutention"]
["France","Pays de la Loire","Maine-et-Loire","Doué la Fontaine",null,"Travaux publics",null,null,"Conducteur d’engins de chantiers urbains"]
["France","Pays de la Loire","Maine-et-Loire","Doué la Fontaine",null,"Bâtiment",null,null,"Technicien supérieur géomètre topographe option cabinet de géomètre"]
["France","Pays de la Loire","Maine-et-Loire","Doué la Fontaine",null,"Industrie",null,null,"Technicien de maintenance industrielle"]
["France","Pays de la Loire","Maine-et-Loire","Doué la Fontaine",null,"Travaux publics",null,null,"Canalisateur"]
["France","Pays de la Loire","Maine-et-Loire","Doué la Fontaine",null,"Travaux publics",null,null,"Technicien supérieur géomètre topographe option entreprise de travaux publics"]
["France","Pays de la Loire","Vendée","Fontenay le Comte",null,"Industrie",null,null,"Mécanicien(ne) automobile"]
["France","Pays de la Loire","Vendée","Fontenay le Comte",null,"Bâtiment",null,null,"Monteur dépanneur frigoriste"]
["France","Pays de la Loire","Vendée","Fontenay le Comte",null,"Industrie",null,null,"Mécanicien réparateur de motocycles"]
["France","Pays de la Loire","Vendée","Fontenay le Comte",null,"Commerce - vente - distribution",null,null,"Assistant manager d’unité marchande"]
["France","Pays de la Loire","Vendée","Fontenay le Comte",null,"Industrie",null,null,"Carrossier réparateur"]
["France","Pays de la Loire","Vendée","Fontenay le Comte",null,"Commerce - vente - distribution",null,null,"Conseiller commercial"]
["France","Pays de la Loire","Vendée","Fontenay le Comte",null,"Commerce - vente - distribution",null,null,"Manager d’unité marchande"]
["France","Pays de la Loire","Vendée","Fontenay le Comte",null,"Bâtiment",null,null,"Technicien d'intervention en froid commercial et climatisation"]
["France","Pays de la Loire","Vendée","Fontenay le Comte",null,"Bâtiment",null,null,"Installateur en thermique et sanitaire"]
["France","Pays de la Loire","Vendée","Fontenay le Comte",null,"Industrie",null,null,"Technicien en usinage assisté par ordinateur"]
["France","Pays de la Loire","Vendée","Fontenay le Comte",null,"Bâtiment",null,null,"Menuisier agenceur"]
["France","Pays de la Loire","Vendée","Fontenay le Comte",null,"Commerce - vente - distribution",null,null,"Négociateur technico-commercial"]
["France","Pays de la Loire","Vendée","Fontenay le Comte",null,"Bâtiment",null,null,"Agent de maintenance des bâtiments"]
["France","Pays de la Loire","Vendée","Fontenay le Comte",null,"Fonctions supports de l'entreprise",null,null,"Secrétaire assistant"]
["France","Pays de la Loire","Vendée","Fontenay le Comte",null,"Fonctions supports de l'entreprise",null,null,"Comptable assistant"]
["France","Pays de la Loire","Vendée","Fontenay le Comte",null,"Fonctions supports de l'entreprise",null,null,"Secrétaire comptable"]
["France","Pays de la Loire","Vendée","Fontenay le Comte",null,"Réseaux - Télécommunications - Informatique - Numérique",null,null,"Installateur de réseaux de télécommunications"]
["France","Pays de la Loire","Vendée","Fontenay le Comte",null,"Transports - logistique",null,null,"Technicien(ne) en logistique d'entreposage"]
["France","Pays de la Loire","Vendée","Fontenay le Comte",null,"Services aux entreprises et à la personne",null,null,"Ouvrier du paysage"]
["France","Pays de la Loire","Vendée","Fontenay le Comte",null,"Industrie",null,null,"Ajusteur monteur aéronautique"]
["France","Pays de la Loire","Vendée","Fontenay le Comte",null,"Bâtiment",null,null,"Electricien d'équipement du bâtiment"]
["France","Pays de la Loire","Vendée","Fontenay le Comte",null,"Réseaux - Télécommunications - Informatique - Numérique",null,null,"Technicien de réseaux de télécommunications"]
["France","Pays de la Loire","Vendée","Fontenay le Comte",null,"Transports - logistique",null,null,"Agent magasinier"]
["France","Pays de la Loire","Vendée","Fontenay le Comte",null,"Réseaux - Télécommunications - Informatique - Numérique",null,null,"Technicien d'assistance en informatique"]
["France","Pays de la Loire","Vendée","Fontenay le Comte",null,"Bâtiment",null,null,"Technicien du bâtiment communicant et connecté"]
["France","Pays de la Loire","Vendée","Fontenay le Comte",null,"Commerce - vente - distribution",null,null,"Vendeur-conseil en magasin"]
["France","Pays de la Loire","Vendée","Fontenay le Comte",null,"Fonctions supports de l'entreprise",null,null,"Gestionnaire de paie"]
["France","Pays de la Loire","Vendée","Fontenay le Comte",null,"Industrie",null,null,"Fraiseur en réalisation de pièces mécaniques"]
["France","Pays de la Loire","Vendée","Fontenay le Comte",null,"Réseaux - Télécommunications - Informatique - Numérique",null,null,"Développeur web et web mobile"]
["France","Pays de la Loire","Vendée","Fontenay le Comte",null,"Fonctions supports de l'entreprise",null,null,"Assistant ressources humaines"]
["France","Pays de la Loire","Vendée","Fontenay le Comte",null,"Bâtiment",null,null,"Technicien d'études du bâtiment en dessin de projet"]
["France","Pays de la Loire","Vendée","Fontenay le Comte",null,"Industrie",null,null,"Fraiseur d’outillages en usinage conventionnel et numérique"]
["France","Pays de la Loire","Vendée","Fontenay le Comte",null,"Bâtiment",null,null,"Technicien d'installation en équipements de confort climatique"]
["France","Pays de la Loire","Vendée","Fontenay le Comte",null,"Industrie",null,null,"Monteur câbleur en aéronautique"]
["France","Pays de la Loire","Vendée","Fontenay le Comte",null,"Industrie",null,null,"Inspecteur qualité aéronautique et spatiale"]
["France","Pays de la Loire","Vendée","Fontenay le Comte",null,"Réseaux - Télécommunications - Informatique - Numérique",null,null,"Technicien supérieur systèmes et réseaux"]
["France","Pays de la Loire","Vendée","Fontenay le Comte",null,"Services aux entreprises et à la personne",null,null,"Agent de sûreté et de sécurité privée"]
["France","Pays de la Loire","Vendée","Fontenay le Comte",null,"Industrie",null,null,"Soudeur assembleur industriel"]
["France","Pays de la Loire","Vendée","La Roche sur Yon",null,"Bâtiment",null,null,"Installateur en thermique et sanitaire"]
["France","Pays de la Loire","Vendée","La Roche sur Yon",null,"Industrie",null,null,"Stratifieur multiprocédés en matériaux composites"]
["France","Pays de la Loire","Vendée","La Roche sur Yon",null,"Bâtiment",null,null,"Menuisier agenceur"]
["France","Pays de la Loire","Vendée","La Roche sur Yon",null,"Bâtiment",null,null,"Agent de maintenance des bâtiments"]
["France","Pays de la Loire","Vendée","La Roche sur Yon",null,"Fonctions supports de l'entreprise",null,null,"Secrétaire assistant"]
["France","Pays de la Loire","Vendée","La Roche sur Yon",null,"Fonctions supports de l'entreprise",null,null,"Secrétaire comptable"]
["France","Pays de la Loire","Vendée","La Roche sur Yon",null,"Fonctions supports de l'entreprise",null,null,"Gestionnaire de paie"]
["France","Pays de la Loire","Vendée","La Roche sur Yon",null,"Industrie",null,null,"Agent de fabrication et montage en chaudronnerie"]
["France","Pays de la Loire","Vendée","La Roche sur Yon",null,"Fonctions supports de l'entreprise",null,null,"Assistant ressources humaines"]
["France","Pays de la Loire","Vendée","La Roche sur Yon",null,"Commerce - vente - distribution",null,null,"Assistant commercial"]
["France","Pays de la Loire","Vendée","La Roche sur Yon",null,"Industrie",null,null,"Soudeur TIG électrode enrobée"]
["France","Pays de la Loire","Vendée","La Roche sur Yon",null,"Fonctions supports de l'entreprise",null,null,"Employé administratif et d’accueil"]
["France","Pays de la Loire","Vendée","La Roche sur Yon",null,"Bâtiment",null,null,"Technicien d'installation en équipements de confort climatique"]
["France","Pays de la Loire","Vendée","La Roche sur Yon",null,"Bâtiment",null,null,"Menuisier poseur-installateur"]
["France","Pays de la Loire","Vendée","La Roche sur Yon",null,"Industrie",null,null,"Soudeur assembleur industriel"]
["France","Pays de la Loire","Sarthe","Mans",null,"Industrie",null,null,"Mécanicien réparateur de motocycles"]
["France","Pays de la Loire","Sarthe","Mans",null,"Fonctions supports de l'entreprise",null,null,"Gestionnaire comptable et fiscal"]
["France","Pays de la Loire","Sarthe","Mans",null,"Bâtiment",null,null,"Technicien supérieur du bâtiment option économie de la construction"]
["France","Pays de la Loire","Sarthe","Mans",null,"Commerce - vente - distribution",null,null,"Employé technicien-vendeur en matériel de sport"]
["France","Pays de la Loire","Sarthe","Mans",null,"Industrie",null,null,"Technicien supérieur en conception industrielle de systèmes mécaniques"]
["France","Pays de la Loire","Sarthe","Mans",null,"Bâtiment",null,null,"Monteur de réseaux électriques aéro-souterrains"]
["France","Pays de la Loire","Sarthe","Mans",null,"Bâtiment",null,null,"Agent de maintenance des bâtiments"]
["France","Pays de la Loire","Sarthe","Mans",null,"Fonctions supports de l'entreprise",null,null,"Secrétaire assistant"]
["France","Pays de la Loire","Sarthe","Mans",null,"Transports - logistique",null,null,"Exploitant en transport routier de marchandises"]
["France","Pays de la Loire","Sarthe","Mans",null,"Fonctions supports de l'entreprise",null,null,"Comptable assistant"]
["France","Pays de la Loire","Sarthe","Mans",null,"Fonctions supports de l'entreprise",null,null,"Secrétaire comptable"]
["France","Pays de la Loire","Sarthe","Mans",null,"Bâtiment",null,null,"Electricien d'équipement du bâtiment"]
["France","Pays de la Loire","Sarthe","Mans",null,"Transports - logistique",null,null,"Préparateur de commandes en entrepôt"]
["France","Pays de la Loire","Sarthe","Mans",null,"Transports - logistique",null,null,"Agent magasinier"]
["France","Pays de la Loire","Sarthe","Mans",null,"Fonctions supports de l'entreprise",null,null,"Gestionnaire de paie"]
["France","Pays de la Loire","Sarthe","Mans",null,"Industrie",null,null,"Technicien d'études en mécanique"]
["France","Pays de la Loire","Sarthe","Mans",null,"Fonctions supports de l'entreprise",null,null,"Assistant ressources humaines"]
["France","Pays de la Loire","Sarthe","Mans",null,"Commerce - vente - distribution",null,null,"Assistant commercial"]
["France","Pays de la Loire","Sarthe","Mans",null,"Industrie",null,null,"Soudeur TIG électrode enrobée"]
["France","Pays de la Loire","Sarthe","Mans",null,"Fonctions supports de l'entreprise",null,null,"Employé administratif et d’accueil"]
["France","Pays de la Loire","Sarthe","Mans",null,"Transports - logistique",null,null,"Gestionnaire des opérations de transport routier de marchandises"]
["France","Pays de la Loire","Sarthe","Mans",null,"Bâtiment",null,null,"Conducteur de travaux du bâtiment et du génie civil"]
["France","Pays de la Loire","Sarthe","Mans",null,"Bâtiment",null,null,"Technicien supérieur du bâtiment option étude de prix"]
["France","Pays de la Loire","Sarthe","Mans",null,"Industrie",null,null,"Soudeur assembleur industriel"]
["France","Pays de la Loire","Sarthe","Mans",null,"Bâtiment",null,null,"Technicien métreur du bâtiment"]
["France","Pays de la Loire","Sarthe","Mans",null,"Industrie",null,null,"Technicien supérieur de contrôle non destructif"]
["France",null,"Loire-Atlantique","Nantes Saint Herblain",null,"Bâtiment",null,null,"Monteur dépanneur frigoriste"]
["France",null,"Loire-Atlantique","Nantes Saint Herblain",null,"Fonctions supports de l'entreprise",null,null,"Secrétaire assistant médico-social"]
["France",null,"Loire-Atlantique","Nantes Saint Herblain",null,"Commerce - vente - distribution",null,null,"Cordonnier multiservices"]
["France",null,"Loire-Atlantique","Nantes Saint Herblain",null,"Bâtiment",null,null,"Installateur en thermique et sanitaire"]
["France",null,"Loire-Atlantique","Nantes Saint Herblain",null,"Industrie",null,null,"Tuyauteur industriel"]
["France",null,"Loire-Atlantique","Nantes Saint Herblain",null,"Industrie",null,null,"Mécanicien(ne) de maintenance automobile"]
["France",null,"Loire-Atlantique","Nantes Saint Herblain",null,"Travaux publics",null,null,"Monteur de réseaux électriques aéro-souterrains"]
["France",null,"Loire-Atlantique","Nantes Saint Herblain",null,"Fonctions supports de l'entreprise",null,null,"Formateur professionnel d'adultes"]
["France",null,"Loire-Atlantique","Nantes Saint Herblain",null,"Bâtiment",null,null,"Agent de maintenance des bâtiments"]
["France",null,"Loire-Atlantique","Nantes Saint Herblain",null,"Fonctions supports de l'entreprise",null,null,"Secrétaire assistant"]
["France",null,"Loire-Atlantique","Nantes Saint Herblain",null,"Bâtiment",null,null,"Façadier-peintre"]
["France",null,"Loire-Atlantique","Nantes Saint Herblain",null,"Fonctions supports de l'entreprise",null,null,"Comptable assistant"]
["France",null,"Loire-Atlantique","Nantes Saint Herblain",null,"Fonctions supports de l'entreprise",null,null,"Secrétaire comptable"]
["France",null,"Loire-Atlantique","Nantes Saint Herblain",null,"Insertion et de la médiation",null,null,"Conseiller en insertion professionnelle"]
["France",null,"Loire-Atlantique","Nantes Saint Herblain",null,"Réseaux - Télécommunications - Informatique - Numérique",null,null,"Installateur de réseaux de télécommunications"]
["France",null,"Loire-Atlantique","Nantes Saint Herblain",null,"Réseaux - Télécommunications - Informatique - Numérique",null,null,"Technicien de réseaux de télécommunications"]
["France",null,"Loire-Atlantique","Nantes Saint Herblain",null,"Fonctions supports de l'entreprise",null,null,"Gestionnaire de paie"]
["France",null,"Loire-Atlantique","Nantes Saint Herblain",null,"Industrie",null,null,"Agent de fabrication et montage en chaudronnerie"]
["France",null,"Loire-Atlantique","Nantes Saint Herblain",null,"Fonctions supports de l'entreprise",null,null,"Assistant ressources humaines"]
["France",null,"Loire-Atlantique","Nantes Saint Herblain",null,"Fonctions supports de l'entreprise",null,null,"Employé administratif et d’accueil"]
["France",null,"Loire-Atlantique","Nantes Saint Herblain",null,"Bâtiment",null,null,"Chargé de travaux en réseaux électriques aériens et souterrains"]
["France",null,"Loire-Atlantique","Saint Nazaire",null,"Fonctions supports de l'entreprise",null,null,"Secrétaire assistant médico-social"]
["France",null,"Loire-Atlantique","Saint Nazaire",null,"Travaux publics",null,null,"Maçon en voirie et réseaux divers"]
["France",null,"Loire-Atlantique","Saint Nazaire",null,"Bâtiment",null,null,"Couvreur-zingueur"]
["France",null,"Loire-Atlantique","Saint Nazaire",null,"Hôtellerie - restauration - tourisme - loisirs",null,null,"Agent(e) de restauration"]
["France",null,"Loire-Atlantique","Saint Nazaire",null,"Bâtiment",null,null,"Menuisier agenceur"]
["France",null,"Loire-Atlantique","Saint Nazaire",null,"Industrie",null,null,"Chaudronnier formeur aéronautique"]
["France",null,"Loire-Atlantique","Saint Nazaire",null,"Bâtiment",null,null,"Plaquiste-plâtrier"]
["France",null,"Loire-Atlantique","Saint Nazaire",null,"Hôtellerie - restauration - tourisme - loisirs",null,null,"Cuisinier"]
["France",null,"Loire-Atlantique","Saint Nazaire",null,"Bâtiment",null,null,"Agent de maintenance des bâtiments"]
["France",null,"Loire-Atlantique","Saint Nazaire",null,"Fonctions supports de l'entreprise",null,null,"Secrétaire assistant"]
["France",null,"Loire-Atlantique","Saint Nazaire",null,"Fonctions supports de l'entreprise",null,null,"Secrétaire comptable"]
["France",null,"Loire-Atlantique","Saint Nazaire",null,"Industrie",null,null,"Ajusteur monteur aéronautique"]
["France",null,"Loire-Atlantique","Saint Nazaire",null,"Bâtiment",null,null,"Electricien d'équipement du bâtiment"]
["France",null,"Loire-Atlantique","Saint Nazaire",null,"Industrie",null,null,"Opérateur régleur en usinage assisté par ordinateur"]
["France",null,"Loire-Atlantique","Saint Nazaire",null,"Fonctions supports de l'entreprise",null,null,"Gestionnaire de paie"]
["France",null,"Loire-Atlantique","Saint Nazaire",null,"Industrie",null,null,"Agent de fabrication et montage en chaudronnerie"]
["France",null,"Loire-Atlantique","Saint Nazaire",null,"Commerce - vente - distribution",null,null,"Assistant commercial"]
["France",null,"Loire-Atlantique","Saint Nazaire",null,"Industrie",null,null,"Technicien en chaudronnerie"]
["France",null,"Loire-Atlantique","Saint Nazaire",null,"Fonctions supports de l'entreprise",null,null,"Employé administratif et d’accueil"]
["France",null,"Loire-Atlantique","Saint Nazaire",null,"Industrie",null,null,"Monteur câbleur en aéronautique"]
["France",null,"Loire-Atlantique","Saint Nazaire",null,"Industrie",null,null,"Soudeur assembleur industriel"]

{"sheet":"TCD","index":3,"n_rows":144,"n_cols":15,"rows_kept":144,"cut":false,"hidden":true,"merged":[]}
["Pays","Provinces","Départements","CENTRE",null,{"$f":"A1","v":"Pays"},{"$f":"B1","v":"Provinces"},{"$f":"C1","v":"Départements"},"CENTRE",null,null,{"$f":"IF(F1=0,\"\",F1)","v":"Pays"},{"$f":"IF(G1=0,\"\",G1)","v":"Provinces"},{"$f":"IF(H1=0,\"\",H1)","v":"Départements"},{"$f":"IF(I1=0,\"\",I1)","v":"CENTRE"}]
["France","Occitanie","Aveyron","Rodez",null,{"$f":"IF(A2=\"\",\"\",A2)","v":"France"},{"$f":"IF(B2=\"(vide)\",\"\",B2)","v":"Occitanie"},{"$f":"C2","v":"Aveyron"},{"$f":"D2","v":"Rodez"},null,null,"France","Occitanie","Aveyron","Rodez"]
["France","Pays de la Loire","Maine-et-Loire","Cholet",null,{"$f":"IF(A3=\"\",\"\",A3)","v":"France"},{"$f":"IF(B3=\"(vide)\",\"\",B3)","v":"Pays de la Loire"},{"$f":"C3","v":"Maine-et-Loire"},{"$f":"D3","v":"Cholet"},null,null,{"$f":"IF(F3=0,\"\",F3)","v":"France"},{"$f":"IF(G3=0,\"\",G3)","v":"Pays de la Loire"},{"$f":"IF(H3=0,\"\",H3)","v":"Maine-et-Loire"},{"$f":"IF(I3=0,\"\",I3)","v":"Cholet"}]
["France","Auvergne-Rhône-Alpes","Drôme","Romans",null,"France","Auvergne-Rhône-Alpes","Drôme","Romans",null,null,{"$f":"IF(F4=0,\"\",F4)","v":"France"},{"$f":"IF(G4=0,\"\",G4)","v":"Auvergne-Rhône-Alpes"},{"$f":"IF(H4=0,\"\",H4)","v":"Drôme"},{"$f":"IF(I4=0,\"\",I4)","v":"Romans"}]
["France","Bourgogne-Franche-Comté","Doubs","Besançon",null,"France",{"$f":"_xlfn.SWITCH(B5,\"(vide)\",\"\",ISBLANK(B5),\"\",B5)","v":"Bourgogne-Franche-Comté"},"Doubs","Besançon",null,null,"France","Bourgogne-Franche-Comté","Doubs","Besançon"]
["France","Centre-Val de Loire","Eure-et-Loir","Chartres",null,"France",{"$f":"_xlfn.SWITCH(B6,\"(vide)\",\"\",ISBLANK(B6),\"\",B6)","v":"Centre-Val de Loire"},"Eure-et-Loir","Chartres",null,null,"France","Centre-Val de Loire","Eure-et-Loir","Chartres"]
["France","Nouvelle-Aquitaine","Charente-Maritime","Rochefort",null,"France",{"$f":"_xlfn.SWITCH(B7,\"(vide)\",\"\",ISBLANK(B7),\"\",B7)","v":"Nouvelle-Aquitaine"},"Charente-Maritime","Rochefort",null,null,"France","Nouvelle-Aquitaine","Charente-Maritime","Rochefort"]
["France","Nouvelle-Aquitaine","Dordogne","Périgueux Boulazac",null,"France",{"$f":"_xlfn.SWITCH(B8,\"(vide)\",\"\",ISBLANK(B8),\"\",B8)","v":"Nouvelle-Aquitaine"},"Dordogne","Périgueux Boulazac",null,null,"France","Nouvelle-Aquitaine","Dordogne","Périgueux Boulazac"]
["France","Nouvelle-Aquitaine","Gironde","Bordeaux Caudéran",null,"France",{"$f":"_xlfn.SWITCH(B9,\"(vide)\",\"\",ISBLANK(B9),\"\",B9)","v":"Nouvelle-Aquitaine"},"Gironde","Bordeaux Caudéran",null,null,"France","Nouvelle-Aquitaine","Gironde","Bordeaux Caudéran"]
["France","Nouvelle-Aquitaine","Haute-Vienne","Limoges Romanet",null,"France",{"$f":"_xlfn.SWITCH(B10,\"(vide)\",\"\",ISBLANK(B10),\"\",B10)","v":"Nouvelle-Aquitaine"},"Haute-Vienne","Limoges Romanet",null,null,"France","Nouvelle-Aquitaine","Haute-Vienne","Limoges Romanet"]
["France","Nouvelle-Aquitaine","Vienne","Châtellerault",null,"France",{"$f":"_xlfn.SWITCH(B11,\"(vide)\",\"\",ISBLANK(B11),\"\",B11)","v":"Nouvelle-Aquitaine"},"Vienne","Châtellerault",null,null,"France","Nouvelle-Aquitaine","Vienne","Châtellerault"]
["France","Nouvelle-Aquitaine","Deux-Sèvres","Niort",null,"France",{"$f":"_xlfn.SWITCH(B12,\"(vide)\",\"\",ISBLANK(B12),\"\",B12)","v":"Nouvelle-Aquitaine"},"Deux-Sèvres","Niort",null,null,"France","Nouvelle-Aquitaine","Deux-Sèvres","Niort"]
[null,null,null,null,null,"",{"$f":"_xlfn.SWITCH(B13,\"(vide)\",\"\",ISBLANK(B13),\"\",B13)","v":0},0,0,null,null,"","","",""]
[null,null,null,null,null,"",{"$f":"_xlfn.SWITCH(B14,\"(vide)\",\"\",ISBLANK(B14),\"\",B14)","v":0},0,0,null,null,"","","",""]
[null,null,null,null,null,"",{"$f":"_xlfn.SWITCH(B15,\"(vide)\",\"\",ISBLANK(B15),\"\",B15)","v":0},0,0,null,null,"","","",""]
[null,null,null,null,null,"",{"$f":"_xlfn.SWITCH(B16,\"(vide)\",\"\",ISBLANK(B16),\"\",B16)","v":0},0,0,null,null,"","","",""]
[null,null,null,null,null,"",{"$f":"_xlfn.SWITCH(B17,\"(vide)\",\"\",ISBLANK(B17),\"\",B17)","v":0},0,0,null,null,"","","",""]
[null,null,null,null,null,"",{"$f":"_xlfn.SWITCH(B18,\"(vide)\",\"\",ISBLANK(B18),\"\",B18)","v":0},0,0,null,null,"","","",""]
[null,null,null,null,null,"",{"$f":"_xlfn.SWITCH(B19,\"(vide)\",\"\",ISBLANK(B19),\"\",B19)","v":0},0,0,null,null,"","","",""]
[null,null,null,null,null,"",{"$f":"_xlfn.SWITCH(B20,\"(vide)\",\"\",ISBLANK(B20),\"\",B20)","v":0},0,0,null,null,"","","",""]
[null,null,null,null,null,"",{"$f":"_xlfn.SWITCH(B21,\"(vide)\",\"\",ISBLANK(B21),\"\",B21)","v":0},0,0,null,null,"","","",""]
[null,null,null,null,null,"",{"$f":"_xlfn.SWITCH(B22,\"(vide)\",\"\",ISBLANK(B22),\"\",B22)","v":0},0,0,null,null,"","","",""]
[null,null,null,null,null,"",{"$f":"_xlfn.SWITCH(B23,\"(vide)\",\"\",ISBLANK(B23),\"\",B23)","v":0},0,0,null,null,"","","",""]
[null,null,null,null,null,"",{"$f":"_xlfn.SWITCH(B24,\"(vide)\",\"\",ISBLANK(B24),\"\",B24)","v":0},0,0,null,null,"","","",""]
[null,null,null,null,null,"",{"$f":"_xlfn.SWITCH(B25,\"(vide)\",\"\",ISBLANK(B25),\"\",B25)","v":0},0,0,null,null,"","","",""]
[null,null,null,null,null,"",{"$f":"_xlfn.SWITCH(B26,\"(vide)\",\"\",ISBLANK(B26),\"\",B26)","v":0},0,0,null,null,"","","",""]
[null,null,null,null,null,"",{"$f":"_xlfn.SWITCH(B27,\"(vide)\",\"\",ISBLANK(B27),\"\",B27)","v":0},0,0,null,null,"","","",""]
[null,null,null,null,null,"",{"$f":"_xlfn.SWITCH(B28,\"(vide)\",\"\",ISBLANK(B28),\"\",B28)","v":0},0,0,null,null,"","","",""]
[null,null,null,null,null,"",{"$f":"_xlfn.SWITCH(B29,\"(vide)\",\"\",ISBLANK(B29),\"\",B29)","v":0},0,0,null,null,"","","",""]
[null,null,null,null,null,"",{"$f":"_xlfn.SWITCH(B30,\"(vide)\",\"\",ISBLANK(B30),\"\",B30)","v":0},0,0,null,null,"","","",""]
[null,null,null,null,null,"",{"$f":"_xlfn.SWITCH(B31,\"(vide)\",\"\",ISBLANK(B31),\"\",B31)","v":0},0,0,null,null,"","","",""]
[null,null,null,null,null,"",{"$f":"_xlfn.SWITCH(B32,\"(vide)\",\"\",ISBLANK(B32),\"\",B32)","v":0},0,0,null,null,"","","",""]
[null,null,null,null,null,"",{"$f":"_xlfn.SWITCH(B33,\"(vide)\",\"\",ISBLANK(B33),\"\",B33)","v":0},0,0,null,null,"","","",""]
[null,null,null,null,null,"",{"$f":"_xlfn.SWITCH(B34,\"(vide)\",\"\",ISBLANK(B34),\"\",B34)","v":0},0,0,null,null,"","","",""]
[null,null,null,null,null,"",{"$f":"_xlfn.SWITCH(B35,\"(vide)\",\"\",ISBLANK(B35),\"\",B35)","v":0},0,0,null,null,"","","",""]
[null,null,null,null,null,"",{"$f":"_xlfn.SWITCH(B36,\"(vide)\",\"\",ISBLANK(B36),\"\",B36)","v":0},0,0,null,null,"","","",""]
[null,null,null,null,null,"",{"$f":"_xlfn.SWITCH(B37,\"(vide)\",\"\",ISBLANK(B37),\"\",B37)","v":0},0,0,null,null,"","","",""]
[null,null,null,null,null,"",{"$f":"_xlfn.SWITCH(B38,\"(vide)\",\"\",ISBLANK(B38),\"\",B38)","v":0},0,0,null,null,"","","",""]
[null,null,null,null,null,"",{"$f":"_xlfn.SWITCH(B39,\"(vide)\",\"\",ISBLANK(B39),\"\",B39)","v":0},0,0,null,null,"","","",""]
[null,null,null,null,null,"",{"$f":"_xlfn.SWITCH(B40,\"(vide)\",\"\",ISBLANK(B40),\"\",B40)","v":0},0,0,null,null,"","","",""]
[null,null,null,null,null,"",{"$f":"_xlfn.SWITCH(B41,\"(vide)\",\"\",ISBLANK(B41),\"\",B41)","v":0},0,0,null,null,"","","",""]
[null,null,null,null,null,"",{"$f":"_xlfn.SWITCH(B42,\"(vide)\",\"\",ISBLANK(B42),\"\",B42)","v":0},0,0,null,null,"","","",""]
[null,null,null,null,null,"",{"$f":"_xlfn.SWITCH(B43,\"(vide)\",\"\",ISBLANK(B43),\"\",B43)","v":0},0,0,null,null,"","","",""]
[null,null,null,null,null,"",{"$f":"_xlfn.SWITCH(B44,\"(vide)\",\"\",ISBLANK(B44),\"\",B44)","v":0},0,0,null,null,"","","",""]
[null,null,null,null,null,"",{"$f":"_xlfn.SWITCH(B45,\"(vide)\",\"\",ISBLANK(B45),\"\",B45)","v":0},0,0,null,null,"","","",""]
[null,null,null,null,null,"",{"$f":"_xlfn.SWITCH(B46,\"(vide)\",\"\",ISBLANK(B46),\"\",B46)","v":0},0,0,null,null,"","","",""]
[null,null,null,null,null,"",{"$f":"_xlfn.SWITCH(B47,\"(vide)\",\"\",ISBLANK(B47),\"\",B47)","v":0},0,0,null,null,"","","",""]
[null,null,null,null,null,"",{"$f":"_xlfn.SWITCH(B48,\"(vide)\",\"\",ISBLANK(B48),\"\",B48)","v":0},0,0,null,null,"","","",""]
[null,null,null,null,null,"",{"$f":"_xlfn.SWITCH(B49,\"(vide)\",\"\",ISBLANK(B49),\"\",B49)","v":0},0,0,null,null,"","","",""]
[null,null,null,null,null,"",{"$f":"_xlfn.SWITCH(B50,\"(vide)\",\"\",ISBLANK(B50),\"\",B50)","v":0},0,0,null,null,"","","",""]
[null,null,null,null,null,"",{"$f":"_xlfn.SWITCH(B51,\"(vide)\",\"\",ISBLANK(B51),\"\",B51)","v":0},0,0,null,null,"","","",""]
[null,null,null,null,null,"",{"$f":"_xlfn.SWITCH(B52,\"(vide)\",\"\",ISBLANK(B52),\"\",B52)","v":0},0,0,null,null,"","","",""]
[null,null,null,null,null,"",{"$f":"_xlfn.SWITCH(B53,\"(vide)\",\"\",ISBLANK(B53),\"\",B53)","v":0},0,0,null,null,"","","",""]
[null,null,null,null,null,"",{"$f":"_xlfn.SWITCH(B54,\"(vide)\",\"\",ISBLANK(B54),\"\",B54)","v":0},0,0,null,null,"","","",""]
[null,null,null,null,null,"",{"$f":"_xlfn.SWITCH(B55,\"(vide)\",\"\",ISBLANK(B55),\"\",B55)","v":0},0,0,null,null,"","","",""]
[null,null,null,null,null,"",{"$f":"_xlfn.SWITCH(B56,\"(vide)\",\"\",ISBLANK(B56),\"\",B56)","v":0},0,0,null,null,"","","",""]
[null,null,null,null,null,"",{"$f":"_xlfn.SWITCH(B57,\"(vide)\",\"\",ISBLANK(B57),\"\",B57)","v":0},0,0,null,null,"","","",""]
[null,null,null,null,null,"",{"$f":"_xlfn.SWITCH(B58,\"(vide)\",\"\",ISBLANK(B58),\"\",B58)","v":0},0,0,null,null,"","","",""]
[null,null,null,null,null,"",{"$f":"_xlfn.SWITCH(B59,\"(vide)\",\"\",ISBLANK(B59),\"\",B59)","v":0},0,0,null,null,"","","",""]
[null,null,null,null,null,"",{"$f":"_xlfn.SWITCH(B60,\"(vide)\",\"\",ISBLANK(B60),\"\",B60)","v":0},0,0,null,null,"","","",""]
[null,null,null,null,null,"",{"$f":"_xlfn.SWITCH(B61,\"(vide)\",\"\",ISBLANK(B61),\"\",B61)","v":0},0,0,null,null,"","","",""]
[null,null,null,null,null,"",{"$f":"_xlfn.SWITCH(B62,\"(vide)\",\"\",ISBLANK(B62),\"\",B62)","v":0},0,0,null,null,"","","",""]
[null,null,null,null,null,"",{"$f":"_xlfn.SWITCH(B63,\"(vide)\",\"\",ISBLANK(B63),\"\",B63)","v":0},0,0,null,null,"","","",""]
[null,null,null,null,null,"",{"$f":"_xlfn.SWITCH(B64,\"(vide)\",\"\",ISBLANK(B64),\"\",B64)","v":0},0,0,null,null,"","","",""]
[null,null,null,null,null,"",{"$f":"_xlfn.SWITCH(B65,\"(vide)\",\"\",ISBLANK(B65),\"\",B65)","v":0},0,0,null,null,"","","",""]
[null,null,null,null,null,"",{"$f":"_xlfn.SWITCH(B66,\"(vide)\",\"\",ISBLANK(B66),\"\",B66)","v":0},0,0,null,null,"","","",""]
[null,null,null,null,null,{"$f":"IF(A67=\"\",\"\",A67)","v":""},{"$f":"_xlfn.SWITCH(B67,\"(vide)\",\"\",ISBLANK(B67),\"\",B67)","v":0},{"$f":"C67","v":0},{"$f":"D67","v":0},null,null,"","","",""]
[null,null,null,null,null,"",{"$f":"_xlfn.SWITCH(B68,\"(vide)\",\"\",ISBLANK(B68),\"\",B68)","v":0},0,0,null,null,{"$f":"IF(F68=0,\"\",F68)","v":""},{"$f":"IF(G68=0,\"\",G68)","v":""},{"$f":"IF(H68=0,\"\",H68)","v":""},{"$f":"IF(I68=0,\"\",I68)","v":""}]
[null,null,null,null,null,"",{"$f":"_xlfn.SWITCH(B69,\"(vide)\",\"\",ISBLANK(B69),\"\",B69)","v":0},0,0,null,null,"","","",""]
[null,null,null,null,null,"",{"$f":"_xlfn.SWITCH(B70,\"(vide)\",\"\",ISBLANK(B70),\"\",B70)","v":0},0,0,null,null,"","","",""]
[null,null,null,null,null,"",{"$f":"_xlfn.SWITCH(B71,\"(vide)\",\"\",ISBLANK(B71),\"\",B71)","v":0},0,0,null,null,"","","",""]
[null,null,null,null,null,"",{"$f":"_xlfn.SWITCH(B72,\"(vide)\",\"\",ISBLANK(B72),\"\",B72)","v":0},0,0,null,null,"","","",""]
[null,null,null,null,null,"",{"$f":"_xlfn.SWITCH(B73,\"(vide)\",\"\",ISBLANK(B73),\"\",B73)","v":0},0,0,null,null,"","","",""]
[null,null,null,null,null,"",{"$f":"_xlfn.SWITCH(B74,\"(vide)\",\"\",ISBLANK(B74),\"\",B74)","v":0},0,0,null,null,"","","",""]
[null,null,null,null,null,"",{"$f":"_xlfn.SWITCH(B75,\"(vide)\",\"\",ISBLANK(B75),\"\",B75)","v":0},0,0,null,null,"","","",""]
[null,null,null,null,null,"",{"$f":"_xlfn.SWITCH(B76,\"(vide)\",\"\",ISBLANK(B76),\"\",B76)","v":0},0,0,null,null,"","","",""]
[null,null,null,null,null,"",{"$f":"_xlfn.SWITCH(B77,\"(vide)\",\"\",ISBLANK(B77),\"\",B77)","v":0},0,0,null,null,"","","",""]
[null,null,null,null,null,"",{"$f":"_xlfn.SWITCH(B78,\"(vide)\",\"\",ISBLANK(B78),\"\",B78)","v":0},0,0,null,null,"","","",""]
[null,null,null,null,null,"",{"$f":"_xlfn.SWITCH(B79,\"(vide)\",\"\",ISBLANK(B79),\"\",B79)","v":0},0,0,null,null,"","","",""]
[null,null,null,null,null,"",{"$f":"_xlfn.SWITCH(B80,\"(vide)\",\"\",ISBLANK(B80),\"\",B80)","v":0},0,0,null,null,"","","",""]
[null,null,null,null,null,"",{"$f":"_xlfn.SWITCH(B81,\"(vide)\",\"\",ISBLANK(B81),\"\",B81)","v":0},0,0,null,null,"","","",""]
[null,null,null,null,null,"",{"$f":"_xlfn.SWITCH(B82,\"(vide)\",\"\",ISBLANK(B82),\"\",B82)","v":0},0,0,null,null,"","","",""]
[null,null,null,null,null,"",{"$f":"_xlfn.SWITCH(B83,\"(vide)\",\"\",ISBLANK(B83),\"\",B83)","v":0},0,0,null,null,"","","",""]
[null,null,null,null,null,"",{"$f":"_xlfn.SWITCH(B84,\"(vide)\",\"\",ISBLANK(B84),\"\",B84)","v":0},0,0,null,null,"","","",""]
[null,null,null,null,null,"",{"$f":"_xlfn.SWITCH(B85,\"(vide)\",\"\",ISBLANK(B85),\"\",B85)","v":0},0,0,null,null,"","","",""]
[null,null,null,null,null,"",{"$f":"_xlfn.SWITCH(B86,\"(vide)\",\"\",ISBLANK(B86),\"\",B86)","v":0},0,0,null,null,"","","",""]
[null,null,null,null,null,"",{"$f":"_xlfn.SWITCH(B87,\"(vide)\",\"\",ISBLANK(B87),\"\",B87)","v":0},0,0,null,null,"","","",""]
[null,null,null,null,null,"",{"$f":"_xlfn.SWITCH(B88,\"(vide)\",\"\",ISBLANK(B88),\"\",B88)","v":0},0,0,null,null,"","","",""]
[null,null,null,null,null,"",{"$f":"_xlfn.SWITCH(B89,\"(vide)\",\"\",ISBLANK(B89),\"\",B89)","v":0},0,0,null,null,"","","",""]
[null,null,null,null,null,"",{"$f":"_xlfn.SWITCH(B90,\"(vide)\",\"\",ISBLANK(B90),\"\",B90)","v":0},0,0,null,null,"","","",""]
[null,null,null,null,null,"",{"$f":"_xlfn.SWITCH(B91,\"(vide)\",\"\",ISBLANK(B91),\"\",B91)","v":0},0,0,null,null,"","","",""]
[null,null,null,null,null,"",{"$f":"_xlfn.SWITCH(B92,\"(vide)\",\"\",ISBLANK(B92),\"\",B92)","v":0},0,0,null,null,"","","",""]
[null,null,null,null,null,"",{"$f":"_xlfn.SWITCH(B93,\"(vide)\",\"\",ISBLANK(B93),\"\",B93)","v":0},0,0,null,null,"","","",""]
[null,null,null,null,null,"",{"$f":"_xlfn.SWITCH(B94,\"(vide)\",\"\",ISBLANK(B94),\"\",B94)","v":0},0,0,null,null,"","","",""]
[null,null,null,null,null,"",{"$f":"_xlfn.SWITCH(B95,\"(vide)\",\"\",ISBLANK(B95),\"\",B95)","v":0},0,0,null,null,"","","",""]
[null,null,null,null,null,"",{"$f":"_xlfn.SWITCH(B96,\"(vide)\",\"\",ISBLANK(B96),\"\",B96)","v":0},0,0,null,null,"","","",""]
[null,null,null,null,null,"",{"$f":"_xlfn.SWITCH(B97,\"(vide)\",\"\",ISBLANK(B97),\"\",B97)","v":0},0,0,null,null,"","","",""]
[null,null,null,null,null,"",{"$f":"_xlfn.SWITCH(B98,\"(vide)\",\"\",ISBLANK(B98),\"\",B98)","v":0},0,0,null,null,"","","",""]
[null,null,null,null,null,"",{"$f":"_xlfn.SWITCH(B99,\"(vide)\",\"\",ISBLANK(B99),\"\",B99)","v":0},0,0,null,null,"","","",""]
[null,null,null,null,null,"",{"$f":"_xlfn.SWITCH(B100,\"(vide)\",\"\",ISBLANK(B100),\"\",B100)","v":0},0,0,null,null,"","","",""]
[null,null,null,null,null,"",{"$f":"_xlfn.SWITCH(B101,\"(vide)\",\"\",ISBLANK(B101),\"\",B101)","v":0},0,0,null,null,"","","",""]
[null,null,null,null,null,"",{"$f":"_xlfn.SWITCH(B102,\"(vide)\",\"\",ISBLANK(B102),\"\",B102)","v":0},0,0,null,null,"","","",""]
[null,null,null,null,null,"",{"$f":"_xlfn.SWITCH(B103,\"(vide)\",\"\",ISBLANK(B103),\"\",B103)","v":0},0,0,null,null,"","","",""]
[null,null,null,null,null,"",{"$f":"_xlfn.SWITCH(B104,\"(vide)\",\"\",ISBLANK(B104),\"\",B104)","v":0},0,0,null,null,"","","",""]
[null,null,null,null,null,"",{"$f":"_xlfn.SWITCH(B105,\"(vide)\",\"\",ISBLANK(B105),\"\",B105)","v":0},0,0,null,null,"","","",""]
[null,null,null,null,null,"",{"$f":"_xlfn.SWITCH(B106,\"(vide)\",\"\",ISBLANK(B106),\"\",B106)","v":0},0,0,null,null,"","","",""]
[null,null,null,null,null,"",{"$f":"_xlfn.SWITCH(B107,\"(vide)\",\"\",ISBLANK(B107),\"\",B107)","v":0},0,0,null,null,"","","",""]
[null,null,null,null,null,"",{"$f":"_xlfn.SWITCH(B108,\"(vide)\",\"\",ISBLANK(B108),\"\",B108)","v":0},0,0,null,null,"","","",""]
[null,null,null,null,null,"",{"$f":"_xlfn.SWITCH(B109,\"(vide)\",\"\",ISBLANK(B109),\"\",B109)","v":0},0,0,null,null,"","","",""]
[null,null,null,null,null,"",{"$f":"_xlfn.SWITCH(B110,\"(vide)\",\"\",ISBLANK(B110),\"\",B110)","v":0},0,0,null,null,"","","",""]
[null,null,null,null,null,"",{"$f":"_xlfn.SWITCH(B111,\"(vide)\",\"\",ISBLANK(B111),\"\",B111)","v":0},0,0,null,null,"","","",""]
[null,null,null,null,null,"",{"$f":"_xlfn.SWITCH(B112,\"(vide)\",\"\",ISBLANK(B112),\"\",B112)","v":0},0,0,null,null,"","","",""]
[null,null,null,null,null,"",{"$f":"_xlfn.SWITCH(B113,\"(vide)\",\"\",ISBLANK(B113),\"\",B113)","v":0},0,0,null,null,"","","",""]
[null,null,null,null,null,"",{"$f":"_xlfn.SWITCH(B114,\"(vide)\",\"\",ISBLANK(B114),\"\",B114)","v":0},0,0,null,null,"","","",""]
[null,null,null,null,null,"",{"$f":"_xlfn.SWITCH(B115,\"(vide)\",\"\",ISBLANK(B115),\"\",B115)","v":0},0,0,null,null,"","","",""]
[null,null,null,null,null,"",{"$f":"_xlfn.SWITCH(B116,\"(vide)\",\"\",ISBLANK(B116),\"\",B116)","v":0},0,0,null,null,"","","",""]
[null,null,null,null,null,"",{"$f":"_xlfn.SWITCH(B117,\"(vide)\",\"\",ISBLANK(B117),\"\",B117)","v":0},0,0,null,null,"","","",""]
[null,null,null,null,null,"",{"$f":"_xlfn.SWITCH(B118,\"(vide)\",\"\",ISBLANK(B118),\"\",B118)","v":0},0,0,null,null,"","","",""]
[null,null,null,null,null,"",{"$f":"_xlfn.SWITCH(B119,\"(vide)\",\"\",ISBLANK(B119),\"\",B119)","v":0},0,0,null,null,"","","",""]
[null,null,null,null,null,"",{"$f":"_xlfn.SWITCH(B120,\"(vide)\",\"\",ISBLANK(B120),\"\",B120)","v":0},0,0,null,null,"","","",""]
[null,null,null,null,null,"",{"$f":"_xlfn.SWITCH(B121,\"(vide)\",\"\",ISBLANK(B121),\"\",B121)","v":0},0,0,null,null,"","","",""]
[null,null,null,null,null,"",{"$f":"_xlfn.SWITCH(B122,\"(vide)\",\"\",ISBLANK(B122),\"\",B122)","v":0},0,0,null,null,"","","",""]
[null,null,null,null,null,"",{"$f":"_xlfn.SWITCH(B123,\"(vide)\",\"\",ISBLANK(B123),\"\",B123)","v":0},0,0,null,null,"","","",""]
[null,null,null,null,null,"",{"$f":"_xlfn.SWITCH(B124,\"(vide)\",\"\",ISBLANK(B124),\"\",B124)","v":0},0,0,null,null,"","","",""]
[null,null,null,null,null,"",{"$f":"_xlfn.SWITCH(B125,\"(vide)\",\"\",ISBLANK(B125),\"\",B125)","v":0},0,0,null,null,"","","",""]
[null,null,null,null,null,"",{"$f":"_xlfn.SWITCH(B126,\"(vide)\",\"\",ISBLANK(B126),\"\",B126)","v":0},0,0,null,null,"","","",""]
[null,null,null,null,null,"",{"$f":"_xlfn.SWITCH(B127,\"(vide)\",\"\",ISBLANK(B127),\"\",B127)","v":0},0,0,null,null,"","","",""]
[null,null,null,null,null,"",{"$f":"_xlfn.SWITCH(B128,\"(vide)\",\"\",ISBLANK(B128),\"\",B128)","v":0},0,0,null,null,"","","",""]
[null,null,null,null,null,"",{"$f":"_xlfn.SWITCH(B129,\"(vide)\",\"\",ISBLANK(B129),\"\",B129)","v":0},0,0,null,null,"","","",""]
[null,null,null,null,null,"",{"$f":"_xlfn.SWITCH(B130,\"(vide)\",\"\",ISBLANK(B130),\"\",B130)","v":0},0,0,null,null,"","","",""]
[null,null,null,null,null,{"$f":"IF(A131=\"\",\"\",A131)","v":""},{"$f":"_xlfn.SWITCH(B131,\"(vide)\",\"\",ISBLANK(B131),\"\",B131)","v":0},{"$f":"C131","v":0},{"$f":"D131","v":0},null,null,"","","",""]
[null,null,null,null,null,"",{"$f":"_xlfn.SWITCH(B132,\"(vide)\",\"\",ISBLANK(B132),\"\",B132)","v":0},0,0,null,null,{"$f":"IF(F132=0,\"\",F132)","v":""},{"$f":"IF(G132=0,\"\",G132)","v":""},{"$f":"IF(H132=0,\"\",H132)","v":""},{"$f":"IF(I132=0,\"\",I132)","v":""}]
[null,null,null,null,null,"",{"$f":"_xlfn.SWITCH(B133,\"(vide)\",\"\",ISBLANK(B133),\"\",B133)","v":0},0,0,null,null,"","","",""]
[null,null,null,null,null,"",{"$f":"_xlfn.SWITCH(B134,\"(vide)\",\"\",ISBLANK(B134),\"\",B134)","v":0},0,0,null,null,"","","",""]
[null,null,null,null,null,"",{"$f":"_xlfn.SWITCH(B135,\"(vide)\",\"\",ISBLANK(B135),\"\",B135)","v":0},0,0,null,null,"","","",""]
[null,null,null,null,null,"",{"$f":"_xlfn.SWITCH(B136,\"(vide)\",\"\",ISBLANK(B136),\"\",B136)","v":0},0,0,null,null,"","","",""]
[null,null,null,null,null,"",{"$f":"_xlfn.SWITCH(B137,\"(vide)\",\"\",ISBLANK(B137),\"\",B137)","v":0},0,0,null,null,"","","",""]
[null,null,null,null,null,"",{"$f":"_xlfn.SWITCH(B138,\"(vide)\",\"\",ISBLANK(B138),\"\",B138)","v":0},0,0,null,null,"","","",""]
[null,null,null,null,null,"",{"$f":"_xlfn.SWITCH(B139,\"(vide)\",\"\",ISBLANK(B139),\"\",B139)","v":0},0,0,null,null,"","","",""]
[null,null,null,null,null,"",{"$f":"_xlfn.SWITCH(B140,\"(vide)\",\"\",ISBLANK(B140),\"\",B140)","v":0},0,0,null,null,"","","",""]
[null,null,null,null,null,"",{"$f":"_xlfn.SWITCH(B141,\"(vide)\",\"\",ISBLANK(B141),\"\",B141)","v":0},0,0,null,null,"","","",""]
[null,null,null,null,null,"",{"$f":"_xlfn.SWITCH(B142,\"(vide)\",\"\",ISBLANK(B142),\"\",B142)","v":0},0,0,null,null,"","","",""]
[null,null,null,null,null,{"$f":"IF(A143=\"\",\"\",A143)","v":""},{"$f":"_xlfn.SWITCH(B143,\"(vide)\",\"\",ISBLANK(B143),\"\",B143)","v":0},{"$f":"C143","v":0},{"$f":"D143","v":0},null,null,{"$f":"IF(F143=0,\"\",F143)","v":""},{"$f":"IF(G143=0,\"\",G143)","v":""},{"$f":"IF(H143=0,\"\",H143)","v":""},{"$f":"IF(I143=0,\"\",I143)","v":""}]
[null,null,null,null,null,"",{"$f":"_xlfn.SWITCH(B144,\"(vide)\",\"\",ISBLANK(B144),\"\",B144)","v":0},0,0,null,null,"","","",""]

{"sheet":"ARA TCD","index":4,"n_rows":142,"n_cols":15,"rows_kept":142,"cut":false,"hidden":true,"merged":[]}
["Pays","Provinces","Départements","CENTRE",null,{"$f":"A1","v":"Pays"},{"$f":"B1","v":"Provinces"},{"$f":"C1","v":"Départements"},"CENTRE",null,null,{"$f":"IF(F1=0,\"\",F1)","v":"Pays"},"Provinces","Départements","CENTRE"]
["France","Auvergne-Rhône-Alpes","Ain","Bourg en Bresse",null,{"$f":"IF(A2=\"\",\"\",A2)","v":"France"},{"$f":"IF(B2=\"(vide)\",\"\",B2)","v":"Auvergne-Rhône-Alpes"},"Ain","Bourg en Bresse",null,null,"France","Auvergne-Rhône-Alpes","Ain","Bourg en Bresse"]
["France","Auvergne-Rhône-Alpes","Allier","Montluçon",null,{"$f":"IF(A3=\"\",\"\",A3)","v":"France"},{"$f":"IF(B3=\"(vide)\",\"\",B3)","v":"Auvergne-Rhône-Alpes"},"Allier","Montluçon",null,null,{"$f":"IF(F3=0,\"\",F3)","v":"France"},{"$f":"IF(G3=0,\"\",G3)","v":"Auvergne-Rhône-Alpes"},{"$f":"IF(H3=0,\"\",H3)","v":"Allier"},{"$f":"IF(I3=0,\"\",I3)","v":"Montluçon"}]
["France","Auvergne-Rhône-Alpes","Drôme","Romans",null,"France","Auvergne-Rhône-Alpes","Drôme","Romans",null,null,{"$f":"IF(F4=0,\"\",F4)","v":"France"},"Auvergne-Rhône-Alpes","Drôme","Romans"]
["France","Auvergne-Rhône-Alpes","Drôme","Valence",null,"France",{"$f":"_xlfn.SWITCH(B5,\"(vide)\",\"\",ISBLANK(B5),\"\",B5)","v":"Auvergne-Rhône-Alpes"},"Drôme","Valence",null,null,"France","Auvergne-Rhône-Alpes","Drôme","Valence"]
["France","Auvergne-Rhône-Alpes","Haute-Loire","Puy en Velay",null,"France",{"$f":"_xlfn.SWITCH(B6,\"(vide)\",\"\",ISBLANK(B6),\"\",B6)","v":"Auvergne-Rhône-Alpes"},"Haute-Loire","Puy en Velay",null,null,"France","Auvergne-Rhône-Alpes","Haute-Loire","Puy en Velay"]
["France","Auvergne-Rhône-Alpes","Haute-Savoie","Annecy Poisy",null,"France",{"$f":"_xlfn.SWITCH(B7,\"(vide)\",\"\",ISBLANK(B7),\"\",B7)","v":"Auvergne-Rhône-Alpes"},"Haute-Savoie","Annecy Poisy",null,null,"France","Auvergne-Rhône-Alpes","Haute-Savoie","Annecy Poisy"]
["France","Auvergne-Rhône-Alpes","Isère","Grenoble Pt de Claix",null,"France",{"$f":"_xlfn.SWITCH(B8,\"(vide)\",\"\",ISBLANK(B8),\"\",B8)","v":"Auvergne-Rhône-Alpes"},"Isère","Grenoble Pt de Claix",null,null,"France","Auvergne-Rhône-Alpes","Isère","Grenoble Pt de Claix"]
["France","Auvergne-Rhône-Alpes","Loire","Saint Etienne",null,"France",{"$f":"_xlfn.SWITCH(B9,\"(vide)\",\"\",ISBLANK(B9),\"\",B9)","v":"Auvergne-Rhône-Alpes"},"Loire","Saint Etienne",null,null,"France","Auvergne-Rhône-Alpes","Loire","Saint Etienne"]
["France","Auvergne-Rhône-Alpes","Puy-de-Dôme","Clermont Beaumont",null,"France",{"$f":"_xlfn.SWITCH(B10,\"(vide)\",\"\",ISBLANK(B10),\"\",B10)","v":"Auvergne-Rhône-Alpes"},"Puy-de-Dôme","Clermont Beaumont",null,null,"France","Auvergne-Rhône-Alpes","Puy-de-Dôme","Clermont Beaumont"]
["France","Auvergne-Rhône-Alpes","Puy-de-Dôme","Clermont la Sarre",null,"France",{"$f":"_xlfn.SWITCH(B11,\"(vide)\",\"\",ISBLANK(B11),\"\",B11)","v":"Auvergne-Rhône-Alpes"},"Puy-de-Dôme","Clermont la Sarre",null,null,"France","Auvergne-Rhône-Alpes","Puy-de-Dôme","Clermont la Sarre"]
["France","Auvergne-Rhône-Alpes","Rhône","Lyon St Priest",null,"France",{"$f":"_xlfn.SWITCH(B12,\"(vide)\",\"\",ISBLANK(B12),\"\",B12)","v":"Auvergne-Rhône-Alpes"},"Rhône","Lyon St Priest",null,null,"France","Auvergne-Rhône-Alpes","Rhône","Lyon St Priest"]
["France","Auvergne-Rhône-Alpes","Rhône","Lyon Vénissieux",null,"France",{"$f":"_xlfn.SWITCH(B13,\"(vide)\",\"\",ISBLANK(B13),\"\",B13)","v":"Auvergne-Rhône-Alpes"},"Rhône","Lyon Vénissieux",null,null,"France","Auvergne-Rhône-Alpes","Rhône","Lyon Vénissieux"]
["France","Auvergne-Rhône-Alpes","Savoie","Chambéry",null,"France",{"$f":"_xlfn.SWITCH(B14,\"(vide)\",\"\",ISBLANK(B14),\"\",B14)","v":"Auvergne-Rhône-Alpes"},"Savoie","Chambéry",null,null,"France","Auvergne-Rhône-Alpes","Savoie","Chambéry"]
[null,null,null,null,null,"",{"$f":"_xlfn.SWITCH(B15,\"(vide)\",\"\",ISBLANK(B15),\"\",B15)","v":0},0,0,null,null,"","","",""]
[null,null,null,null,null,"",{"$f":"_xlfn.SWITCH(B16,\"(vide)\",\"\",ISBLANK(B16),\"\",B16)","v":0},0,0,null,null,"","","",""]
[null,null,null,null,null,"",{"$f":"_xlfn.SWITCH(B17,\"(vide)\",\"\",ISBLANK(B17),\"\",B17)","v":0},{"$f":"C17","v":0},0,null,null,"","","",""]
[null,null,null,null,null,"",{"$f":"_xlfn.SWITCH(B18,\"(vide)\",\"\",ISBLANK(B18),\"\",B18)","v":0},0,0,null,null,"","","",""]
[null,null,null,null,null,"",{"$f":"_xlfn.SWITCH(B19,\"(vide)\",\"\",ISBLANK(B19),\"\",B19)","v":0},0,0,null,null,"","","",""]
[null,null,null,null,null,"",{"$f":"_xlfn.SWITCH(B20,\"(vide)\",\"\",ISBLANK(B20),\"\",B20)","v":0},0,0,null,null,"","","",""]
[null,null,null,null,null,"",{"$f":"_xlfn.SWITCH(B21,\"(vide)\",\"\",ISBLANK(B21),\"\",B21)","v":0},0,0,null,null,"","","",""]
[null,null,null,null,null,"",{"$f":"_xlfn.SWITCH(B22,\"(vide)\",\"\",ISBLANK(B22),\"\",B22)","v":0},0,0,null,null,"","","",""]
[null,null,null,null,null,"",{"$f":"_xlfn.SWITCH(B23,\"(vide)\",\"\",ISBLANK(B23),\"\",B23)","v":0},0,0,null,null,"","","",""]
[null,null,null,null,null,"",{"$f":"_xlfn.SWITCH(B24,\"(vide)\",\"\",ISBLANK(B24),\"\",B24)","v":0},0,0,null,null,"","","",""]
[null,null,null,null,null,"",{"$f":"_xlfn.SWITCH(B25,\"(vide)\",\"\",ISBLANK(B25),\"\",B25)","v":0},0,0,null,null,"","","",""]
[null,null,null,null,null,"",{"$f":"_xlfn.SWITCH(B26,\"(vide)\",\"\",ISBLANK(B26),\"\",B26)","v":0},0,0,null,null,"","","",""]
[null,null,null,null,null,"",{"$f":"_xlfn.SWITCH(B27,\"(vide)\",\"\",ISBLANK(B27),\"\",B27)","v":0},0,0,null,null,"","","",""]
[null,null,null,null,null,"",{"$f":"_xlfn.SWITCH(B28,\"(vide)\",\"\",ISBLANK(B28),\"\",B28)","v":0},0,0,null,null,"","","",""]
[null,null,null,null,null,"",{"$f":"_xlfn.SWITCH(B29,\"(vide)\",\"\",ISBLANK(B29),\"\",B29)","v":0},0,0,null,null,"","","",""]
[null,null,null,null,null,"",{"$f":"_xlfn.SWITCH(B30,\"(vide)\",\"\",ISBLANK(B30),\"\",B30)","v":0},0,0,null,null,"","","",""]
[null,null,null,null,null,"",{"$f":"_xlfn.SWITCH(B31,\"(vide)\",\"\",ISBLANK(B31),\"\",B31)","v":0},0,0,null,null,"","","",""]
[null,null,null,null,null,"",{"$f":"_xlfn.SWITCH(B32,\"(vide)\",\"\",ISBLANK(B32),\"\",B32)","v":0},0,0,null,null,"","","",""]
[null,null,null,null,null,"",{"$f":"_xlfn.SWITCH(B33,\"(vide)\",\"\",ISBLANK(B33),\"\",B33)","v":0},0,0,null,null,"","","",""]
[null,null,null,null,null,"",{"$f":"_xlfn.SWITCH(B34,\"(vide)\",\"\",ISBLANK(B34),\"\",B34)","v":0},0,0,null,null,"","","",""]
[null,null,null,null,null,"",{"$f":"_xlfn.SWITCH(B35,\"(vide)\",\"\",ISBLANK(B35),\"\",B35)","v":0},0,0,null,null,"","","",""]
[null,null,null,null,null,"",{"$f":"_xlfn.SWITCH(B36,\"(vide)\",\"\",ISBLANK(B36),\"\",B36)","v":0},0,0,null,null,"","","",""]
[null,null,null,null,null,"",{"$f":"_xlfn.SWITCH(B37,\"(vide)\",\"\",ISBLANK(B37),\"\",B37)","v":0},0,0,null,null,"","","",""]
[null,null,null,null,null,"",{"$f":"_xlfn.SWITCH(B38,\"(vide)\",\"\",ISBLANK(B38),\"\",B38)","v":0},0,0,null,null,"","","",""]
[null,null,null,null,null,"",{"$f":"_xlfn.SWITCH(B39,\"(vide)\",\"\",ISBLANK(B39),\"\",B39)","v":0},0,0,null,null,"","","",""]
[null,null,null,null,null,"",{"$f":"_xlfn.SWITCH(B40,\"(vide)\",\"\",ISBLANK(B40),\"\",B40)","v":0},0,0,null,null,"","","",""]
[null,null,null,null,null,"",{"$f":"_xlfn.SWITCH(B41,\"(vide)\",\"\",ISBLANK(B41),\"\",B41)","v":0},0,0,null,null,"","","",""]
[null,null,null,null,null,"",{"$f":"_xlfn.SWITCH(B42,\"(vide)\",\"\",ISBLANK(B42),\"\",B42)","v":0},0,0,null,null,"","","",""]
[null,null,null,null,null,"",{"$f":"_xlfn.SWITCH(B43,\"(vide)\",\"\",ISBLANK(B43),\"\",B43)","v":0},0,0,null,null,"","","",""]
[null,null,null,null,null,"",{"$f":"_xlfn.SWITCH(B44,\"(vide)\",\"\",ISBLANK(B44),\"\",B44)","v":0},0,0,null,null,"","","",""]
[null,null,null,null,null,"",{"$f":"_xlfn.SWITCH(B45,\"(vide)\",\"\",ISBLANK(B45),\"\",B45)","v":0},0,0,null,null,"","","",""]
[null,null,null,null,null,"",{"$f":"_xlfn.SWITCH(B46,\"(vide)\",\"\",ISBLANK(B46),\"\",B46)","v":0},0,0,null,null,"","","",""]
[null,null,null,null,null,"",{"$f":"_xlfn.SWITCH(B47,\"(vide)\",\"\",ISBLANK(B47),\"\",B47)","v":0},0,0,null,null,"","","",""]
[null,null,null,null,null,"",{"$f":"_xlfn.SWITCH(B48,\"(vide)\",\"\",ISBLANK(B48),\"\",B48)","v":0},0,0,null,null,"","","",""]
[null,null,null,null,null,"",{"$f":"_xlfn.SWITCH(B49,\"(vide)\",\"\",ISBLANK(B49),\"\",B49)","v":0},0,0,null,null,"","","",""]
[null,null,null,null,null,"",{"$f":"_xlfn.SWITCH(B50,\"(vide)\",\"\",ISBLANK(B50),\"\",B50)","v":0},0,0,null,null,"","","",""]
[null,null,null,null,null,"",{"$f":"_xlfn.SWITCH(B51,\"(vide)\",\"\",ISBLANK(B51),\"\",B51)","v":0},0,0,null,null,"","","",""]
[null,null,null,null,null,"",{"$f":"_xlfn.SWITCH(B52,\"(vide)\",\"\",ISBLANK(B52),\"\",B52)","v":0},0,0,null,null,"","","",""]
[null,null,null,null,null,"",{"$f":"_xlfn.SWITCH(B53,\"(vide)\",\"\",ISBLANK(B53),\"\",B53)","v":0},0,0,null,null,"","","",""]
[null,null,null,null,null,"",{"$f":"_xlfn.SWITCH(B54,\"(vide)\",\"\",ISBLANK(B54),\"\",B54)","v":0},0,0,null,null,"","","",""]
[null,null,null,null,null,"",{"$f":"_xlfn.SWITCH(B55,\"(vide)\",\"\",ISBLANK(B55),\"\",B55)","v":0},0,0,null,null,"","","",""]
[null,null,null,null,null,"",{"$f":"_xlfn.SWITCH(B56,\"(vide)\",\"\",ISBLANK(B56),\"\",B56)","v":0},0,0,null,null,"","","",""]
[null,null,null,null,null,"",{"$f":"_xlfn.SWITCH(B57,\"(vide)\",\"\",ISBLANK(B57),\"\",B57)","v":0},0,0,null,null,"","","",""]
[null,null,null,null,null,"",{"$f":"_xlfn.SWITCH(B58,\"(vide)\",\"\",ISBLANK(B58),\"\",B58)","v":0},0,0,null,null,"","","",""]
[null,null,null,null,null,"",{"$f":"_xlfn.SWITCH(B59,\"(vide)\",\"\",ISBLANK(B59),\"\",B59)","v":0},0,0,null,null,"","","",""]
[null,null,null,null,null,"",{"$f":"_xlfn.SWITCH(B60,\"(vide)\",\"\",ISBLANK(B60),\"\",B60)","v":0},0,0,null,null,"","","",""]
[null,null,null,null,null,"",{"$f":"_xlfn.SWITCH(B61,\"(vide)\",\"\",ISBLANK(B61),\"\",B61)","v":0},0,0,null,null,"","","",""]
[null,null,null,null,null,"",{"$f":"_xlfn.SWITCH(B62,\"(vide)\",\"\",ISBLANK(B62),\"\",B62)","v":0},0,0,null,null,"","","",""]
[null,null,null,null,null,"",{"$f":"_xlfn.SWITCH(B63,\"(vide)\",\"\",ISBLANK(B63),\"\",B63)","v":0},0,0,null,null,"","","",""]
[null,null,null,null,null,"",{"$f":"_xlfn.SWITCH(B64,\"(vide)\",\"\",ISBLANK(B64),\"\",B64)","v":0},0,0,null,null,"","","",""]
[null,null,null,null,null,"",{"$f":"_xlfn.SWITCH(B65,\"(vide)\",\"\",ISBLANK(B65),\"\",B65)","v":0},0,0,null,null,"","","",""]
[null,null,null,null,null,"",{"$f":"_xlfn.SWITCH(B66,\"(vide)\",\"\",ISBLANK(B66),\"\",B66)","v":0},0,0,null,null,"","","",""]
[null,null,null,null,null,{"$f":"IF(A67=\"\",\"\",A67)","v":""},{"$f":"_xlfn.SWITCH(B67,\"(vide)\",\"\",ISBLANK(B67),\"\",B67)","v":0},0,0,null,null,"","","",{"$f":"IF(I67=0,\"\",I67)","v":""}]
[null,null,null,null,null,"",{"$f":"_xlfn.SWITCH(B68,\"(vide)\",\"\",ISBLANK(B68),\"\",B68)","v":0},0,0,null,null,{"$f":"IF(F68=0,\"\",F68)","v":""},"","",""]
[null,null,null,null,null,"",{"$f":"_xlfn.SWITCH(B69,\"(vide)\",\"\",ISBLANK(B69),\"\",B69)","v":0},0,0,null,null,"","","",""]
[null,null,null,null,null,"",{"$f":"_xlfn.SWITCH(B70,\"(vide)\",\"\",ISBLANK(B70),\"\",B70)","v":0},0,0,null,null,"","","",""]
[null,null,null,null,null,"",{"$f":"_xlfn.SWITCH(B71,\"(vide)\",\"\",ISBLANK(B71),\"\",B71)","v":0},0,0,null,null,"","","",""]
[null,null,null,null,null,"",{"$f":"_xlfn.SWITCH(B72,\"(vide)\",\"\",ISBLANK(B72),\"\",B72)","v":0},0,0,null,null,"","","",""]
[null,null,null,null,null,"",{"$f":"_xlfn.SWITCH(B73,\"(vide)\",\"\",ISBLANK(B73),\"\",B73)","v":0},0,0,null,null,"","","",""]
[null,null,null,null,null,"",{"$f":"_xlfn.SWITCH(B74,\"(vide)\",\"\",ISBLANK(B74),\"\",B74)","v":0},0,0,null,null,"","","",""]
[null,null,null,null,null,"",{"$f":"_xlfn.SWITCH(B75,\"(vide)\",\"\",ISBLANK(B75),\"\",B75)","v":0},0,0,null,null,"","","",""]
[null,null,null,null,null,"",{"$f":"_xlfn.SWITCH(B76,\"(vide)\",\"\",ISBLANK(B76),\"\",B76)","v":0},0,0,null,null,"","","",""]
[null,null,null,null,null,"",{"$f":"_xlfn.SWITCH(B77,\"(vide)\",\"\",ISBLANK(B77),\"\",B77)","v":0},0,0,null,null,"","","",""]
[null,null,null,null,null,"",{"$f":"_xlfn.SWITCH(B78,\"(vide)\",\"\",ISBLANK(B78),\"\",B78)","v":0},0,0,null,null,"","","",""]
[null,null,null,null,null,"",{"$f":"_xlfn.SWITCH(B79,\"(vide)\",\"\",ISBLANK(B79),\"\",B79)","v":0},0,0,null,null,"","","",""]
[null,null,null,null,null,"",{"$f":"_xlfn.SWITCH(B80,\"(vide)\",\"\",ISBLANK(B80),\"\",B80)","v":0},0,0,null,null,"","","",""]
[null,null,null,null,null,"",{"$f":"_xlfn.SWITCH(B81,\"(vide)\",\"\",ISBLANK(B81),\"\",B81)","v":0},{"$f":"C81","v":0},0,null,null,"","","",""]
[null,null,null,null,null,"",{"$f":"_xlfn.SWITCH(B82,\"(vide)\",\"\",ISBLANK(B82),\"\",B82)","v":0},0,0,null,null,"","","",""]
[null,null,null,null,null,"",{"$f":"_xlfn.SWITCH(B83,\"(vide)\",\"\",ISBLANK(B83),\"\",B83)","v":0},0,0,null,null,"","","",""]
[null,null,null,null,null,"",{"$f":"_xlfn.SWITCH(B84,\"(vide)\",\"\",ISBLANK(B84),\"\",B84)","v":0},0,0,null,null,"","","",""]
[null,null,null,null,null,"",{"$f":"_xlfn.SWITCH(B85,\"(vide)\",\"\",ISBLANK(B85),\"\",B85)","v":0},0,0,null,null,"","","",""]
[null,null,null,null,null,"",{"$f":"_xlfn.SWITCH(B86,\"(vide)\",\"\",ISBLANK(B86),\"\",B86)","v":0},0,0,null,null,"","","",""]
[null,null,null,null,null,"",{"$f":"_xlfn.SWITCH(B87,\"(vide)\",\"\",ISBLANK(B87),\"\",B87)","v":0},0,0,null,null,"","","",""]
[null,null,null,null,null,"",{"$f":"_xlfn.SWITCH(B88,\"(vide)\",\"\",ISBLANK(B88),\"\",B88)","v":0},0,0,null,null,"","","",""]
[null,null,null,null,null,"",{"$f":"_xlfn.SWITCH(B89,\"(vide)\",\"\",ISBLANK(B89),\"\",B89)","v":0},0,0,null,null,"","","",""]
[null,null,null,null,null,"",{"$f":"_xlfn.SWITCH(B90,\"(vide)\",\"\",ISBLANK(B90),\"\",B90)","v":0},0,0,null,null,"","","",""]
[null,null,null,null,null,"",{"$f":"_xlfn.SWITCH(B91,\"(vide)\",\"\",ISBLANK(B91),\"\",B91)","v":0},0,0,null,null,"","","",""]
[null,null,null,null,null,"",{"$f":"_xlfn.SWITCH(B92,\"(vide)\",\"\",ISBLANK(B92),\"\",B92)","v":0},0,0,null,null,"","","",""]
[null,null,null,null,null,"",{"$f":"_xlfn.SWITCH(B93,\"(vide)\",\"\",ISBLANK(B93),\"\",B93)","v":0},0,0,null,null,"","","",""]
[null,null,null,null,null,"",{"$f":"_xlfn.SWITCH(B94,\"(vide)\",\"\",ISBLANK(B94),\"\",B94)","v":0},0,0,null,null,"","","",""]
[null,null,null,null,null,"",{"$f":"_xlfn.SWITCH(B95,\"(vide)\",\"\",ISBLANK(B95),\"\",B95)","v":0},0,0,null,null,"","","",""]
[null,null,null,null,null,"",{"$f":"_xlfn.SWITCH(B96,\"(vide)\",\"\",ISBLANK(B96),\"\",B96)","v":0},0,0,null,null,"","","",""]
[null,null,null,null,null,"",{"$f":"_xlfn.SWITCH(B97,\"(vide)\",\"\",ISBLANK(B97),\"\",B97)","v":0},0,0,null,null,"","","",""]
[null,null,null,null,null,"",{"$f":"_xlfn.SWITCH(B98,\"(vide)\",\"\",ISBLANK(B98),\"\",B98)","v":0},0,0,null,null,"","","",""]
[null,null,null,null,null,"",{"$f":"_xlfn.SWITCH(B99,\"(vide)\",\"\",ISBLANK(B99),\"\",B99)","v":0},0,0,null,null,"","","",""]
[null,null,null,null,null,"",{"$f":"_xlfn.SWITCH(B100,\"(vide)\",\"\",ISBLANK(B100),\"\",B100)","v":0},0,0,null,null,"","","",""]
[null,null,null,null,null,"",{"$f":"_xlfn.SWITCH(B101,\"(vide)\",\"\",ISBLANK(B101),\"\",B101)","v":0},0,0,null,null,"","","",""]
[null,null,null,null,null,"",{"$f":"_xlfn.SWITCH(B102,\"(vide)\",\"\",ISBLANK(B102),\"\",B102)","v":0},0,0,null,null,"","","",""]
[null,null,null,null,null,"",{"$f":"_xlfn.SWITCH(B103,\"(vide)\",\"\",ISBLANK(B103),\"\",B103)","v":0},0,0,null,null,"","","",""]
[null,null,null,null,null,"",{"$f":"_xlfn.SWITCH(B104,\"(vide)\",\"\",ISBLANK(B104),\"\",B104)","v":0},0,0,null,null,"","","",""]
[null,null,null,null,null,"",{"$f":"_xlfn.SWITCH(B105,\"(vide)\",\"\",ISBLANK(B105),\"\",B105)","v":0},0,0,null,null,"","","",""]
[null,null,null,null,null,"",{"$f":"_xlfn.SWITCH(B106,\"(vide)\",\"\",ISBLANK(B106),\"\",B106)","v":0},0,0,null,null,"","","",""]
[null,null,null,null,null,"",{"$f":"_xlfn.SWITCH(B107,\"(vide)\",\"\",ISBLANK(B107),\"\",B107)","v":0},0,0,null,null,"","","",""]
[null,null,null,null,null,"",{"$f":"_xlfn.SWITCH(B108,\"(vide)\",\"\",ISBLANK(B108),\"\",B108)","v":0},0,0,null,null,"","","",""]
[null,null,null,null,null,"",{"$f":"_xlfn.SWITCH(B109,\"(vide)\",\"\",ISBLANK(B109),\"\",B109)","v":0},0,0,null,null,"","","",""]
[null,null,null,null,null,"",{"$f":"_xlfn.SWITCH(B110,\"(vide)\",\"\",ISBLANK(B110),\"\",B110)","v":0},0,0,null,null,"","","",""]
[null,null,null,null,null,"",{"$f":"_xlfn.SWITCH(B111,\"(vide)\",\"\",ISBLANK(B111),\"\",B111)","v":0},0,0,null,null,"","","",""]
[null,null,null,null,null,"",{"$f":"_xlfn.SWITCH(B112,\"(vide)\",\"\",ISBLANK(B112),\"\",B112)","v":0},0,0,null,null,"","","",""]
[null,null,null,null,null,"",{"$f":"_xlfn.SWITCH(B113,\"(vide)\",\"\",ISBLANK(B113),\"\",B113)","v":0},0,0,null,null,"","","",""]
[null,null,null,null,null,"",{"$f":"_xlfn.SWITCH(B114,\"(vide)\",\"\",ISBLANK(B114),\"\",B114)","v":0},0,0,null,null,"","","",""]
[null,null,null,null,null,"",{"$f":"_xlfn.SWITCH(B115,\"(vide)\",\"\",ISBLANK(B115),\"\",B115)","v":0},0,0,null,null,"","","",""]
[null,null,null,null,null,"",{"$f":"_xlfn.SWITCH(B116,\"(vide)\",\"\",ISBLANK(B116),\"\",B116)","v":0},0,0,null,null,"","","",""]
[null,null,null,null,null,"",{"$f":"_xlfn.SWITCH(B117,\"(vide)\",\"\",ISBLANK(B117),\"\",B117)","v":0},0,0,null,null,"","","",""]
[null,null,null,null,null,"",{"$f":"_xlfn.SWITCH(B118,\"(vide)\",\"\",ISBLANK(B118),\"\",B118)","v":0},0,0,null,null,"","","",""]
[null,null,null,null,null,"",{"$f":"_xlfn.SWITCH(B119,\"(vide)\",\"\",ISBLANK(B119),\"\",B119)","v":0},0,0,null,null,"","","",""]
[null,null,null,null,null,"",{"$f":"_xlfn.SWITCH(B120,\"(vide)\",\"\",ISBLANK(B120),\"\",B120)","v":0},0,0,null,null,"","","",""]
[null,null,null,null,null,"",{"$f":"_xlfn.SWITCH(B121,\"(vide)\",\"\",ISBLANK(B121),\"\",B121)","v":0},0,0,null,null,"","","",""]
[null,null,null,null,null,"",{"$f":"_xlfn.SWITCH(B122,\"(vide)\",\"\",ISBLANK(B122),\"\",B122)","v":0},0,0,null,null,"","","",""]
[null,null,null,null,null,"",{"$f":"_xlfn.SWITCH(B123,\"(vide)\",\"\",ISBLANK(B123),\"\",B123)","v":0},0,0,null,null,"","","",""]
[null,null,null,null,null,"",{"$f":"_xlfn.SWITCH(B124,\"(vide)\",\"\",ISBLANK(B124),\"\",B124)","v":0},0,0,null,null,"","","",""]
[null,null,null,null,null,"",{"$f":"_xlfn.SWITCH(B125,\"(vide)\",\"\",ISBLANK(B125),\"\",B125)","v":0},0,0,null,null,"","","",""]
[null,null,null,null,null,"",{"$f":"_xlfn.SWITCH(B126,\"(vide)\",\"\",ISBLANK(B126),\"\",B126)","v":0},0,0,null,null,"","","",""]
[null,null,null,null,null,"",{"$f":"_xlfn.SWITCH(B127,\"(vide)\",\"\",ISBLANK(B127),\"\",B127)","v":0},0,0,null,null,"","","",""]
[null,null,null,null,null,"",{"$f":"_xlfn.SWITCH(B128,\"(vide)\",\"\",ISBLANK(B128),\"\",B128)","v":0},0,0,null,null,"","","",""]
[null,null,null,null,null,"",{"$f":"_xlfn.SWITCH(B129,\"(vide)\",\"\",ISBLANK(B129),\"\",B129)","v":0},0,0,null,null,"","","",""]
[null,null,null,null,null,"",{"$f":"_xlfn.SWITCH(B130,\"(vide)\",\"\",ISBLANK(B130),\"\",B130)","v":0},0,0,null,null,"","","",""]
[null,null,null,null,null,{"$f":"IF(A131=\"\",\"\",A131)","v":""},{"$f":"_xlfn.SWITCH(B131,\"(vide)\",\"\",ISBLANK(B131),\"\",B131)","v":0},0,0,null,null,"","","",""]
[null,null,null,null,null,"",{"$f":"_xlfn.SWITCH(B132,\"(vide)\",\"\",ISBLANK(B132),\"\",B132)","v":0},0,0,null,null,{"$f":"IF(F132=0,\"\",F132)","v":""},"","",""]
[null,null,null,null,null,"",{"$f":"_xlfn.SWITCH(B133,\"(vide)\",\"\",ISBLANK(B133),\"\",B133)","v":0},0,0,null,null,"","","",""]
[null,null,null,null,null,"",{"$f":"_xlfn.SWITCH(B134,\"(vide)\",\"\",ISBLANK(B134),\"\",B134)","v":0},0,0,null,null,"","","",""]
[null,null,null,null,null,"",{"$f":"_xlfn.SWITCH(B135,\"(vide)\",\"\",ISBLANK(B135),\"\",B135)","v":0},0,0,null,null,"","","",""]
[null,null,null,null,null,"",{"$f":"_xlfn.SWITCH(B136,\"(vide)\",\"\",ISBLANK(B136),\"\",B136)","v":0},0,0,null,null,"","","",""]
[null,null,null,null,null,"",{"$f":"_xlfn.SWITCH(B137,\"(vide)\",\"\",ISBLANK(B137),\"\",B137)","v":0},0,0,null,null,"","","",""]
[null,null,null,null,null,"",{"$f":"_xlfn.SWITCH(B138,\"(vide)\",\"\",ISBLANK(B138),\"\",B138)","v":0},0,0,null,null,"","","",""]
[null,null,null,null,null,"",{"$f":"_xlfn.SWITCH(B139,\"(vide)\",\"\",ISBLANK(B139),\"\",B139)","v":0},0,0,null,null,"","","",""]
[null,null,null,null,null,"",{"$f":"_xlfn.SWITCH(B140,\"(vide)\",\"\",ISBLANK(B140),\"\",B140)","v":0},0,0,null,null,"","","",""]
[null,null,null,null,null,"",{"$f":"_xlfn.SWITCH(B141,\"(vide)\",\"\",ISBLANK(B141),\"\",B141)","v":0},0,0,null,null,"","","",""]
[null,null,null,null,null,"",{"$f":"_xlfn.SWITCH(B142,\"(vide)\",\"\",ISBLANK(B142),\"\",B142)","v":0},0,0,null,null,"","","",""]

{"sheet":"ARA","index":5,"n_rows":1,"n_cols":1,"rows_kept":1,"cut":false,"hidden":false,"merged":[[0,0,2,22]]}
["REGION \nAUVERGNE-RHÔNE-ALPES"]

{"sheet":"BFC TCD","index":6,"n_rows":142,"n_cols":15,"rows_kept":142,"cut":false,"hidden":true,"merged":[]}
["Pays","Provinces","Départements","CENTRE",null,{"$f":"A1","v":"Pays"},{"$f":"B1","v":"Provinces"},{"$f":"C1","v":"Départements"},"CENTRE",null,null,{"$f":"IF(F1=0,\"\",F1)","v":"Pays"},"Provinces","Départements","CENTRE"]
["France","Bourgogne-Franche-Comté","Côte-d'Or","Dijon Chevigny",null,{"$f":"IF(A2=\"\",\"\",A2)","v":"France"},{"$f":"IF(B2=\"(vide)\",\"\",B2)","v":"Bourgogne-Franche-Comté"},"Côte-d'Or","Dijon Chevigny",null,null,"France","Bourgogne-Franche-Comté","Côte-d'Or","Dijon Chevigny"]
["France","Bourgogne-Franche-Comté","Doubs","Besançon",null,{"$f":"IF(A3=\"\",\"\",A3)","v":"France"},{"$f":"IF(B3=\"(vide)\",\"\",B3)","v":"Bourgogne-Franche-Comté"},"Doubs","Besançon",null,null,{"$f":"IF(F3=0,\"\",F3)","v":"France"},{"$f":"IF(G3=0,\"\",G3)","v":"Bourgogne-Franche-Comté"},{"$f":"IF(H3=0,\"\",H3)","v":"Doubs"},{"$f":"IF(I3=0,\"\",I3)","v":"Besançon"}]
["France","Bourgogne-Franche-Comté","Haute-Saône","Vesoul Navenne",null,"France","Bourgogne-Franche-Comté","Haute-Saône","Vesoul Navenne",null,null,{"$f":"IF(F4=0,\"\",F4)","v":"France"},"Bourgogne-Franche-Comté","Haute-Saône","Vesoul Navenne"]
["France","Bourgogne-Franche-Comté","Jura","Lons le Saunier",null,"France",{"$f":"_xlfn.SWITCH(B5,\"(vide)\",\"\",ISBLANK(B5),\"\",B5)","v":"Bourgogne-Franche-Comté"},"Jura","Lons le Saunier",null,null,"France","Bourgogne-Franche-Comté","Jura","Lons le Saunier"]
["France","Bourgogne-Franche-Comté","Nièvre","Nevers",null,"France",{"$f":"_xlfn.SWITCH(B6,\"(vide)\",\"\",ISBLANK(B6),\"\",B6)","v":"Bourgogne-Franche-Comté"},"Nièvre","Nevers",null,null,"France","Bourgogne-Franche-Comté","Nièvre","Nevers"]
["France","Bourgogne-Franche-Comté","Saône-et-Loire","Montceau les Mines",null,"France",{"$f":"_xlfn.SWITCH(B7,\"(vide)\",\"\",ISBLANK(B7),\"\",B7)","v":"Bourgogne-Franche-Comté"},"Saône-et-Loire","Montceau les Mines",null,null,"France","Bourgogne-Franche-Comté","Saône-et-Loire","Montceau les Mines"]
["France","Bourgogne-Franche-Comté","Territoire-de-Belfort","Belfort",null,"France",{"$f":"_xlfn.SWITCH(B8,\"(vide)\",\"\",ISBLANK(B8),\"\",B8)","v":"Bourgogne-Franche-Comté"},"Territoire-de-Belfort","Belfort",null,null,"France","Bourgogne-Franche-Comté","Territoire-de-Belfort","Belfort"]
["France","Bourgogne-Franche-Comté","Yonne","Migennes",null,"France",{"$f":"_xlfn.SWITCH(B9,\"(vide)\",\"\",ISBLANK(B9),\"\",B9)","v":"Bourgogne-Franche-Comté"},"Yonne","Migennes",null,null,"France","Bourgogne-Franche-Comté","Yonne","Migennes"]
[null,null,null,null,null,"",{"$f":"_xlfn.SWITCH(B10,\"(vide)\",\"\",ISBLANK(B10),\"\",B10)","v":0},0,0,null,null,"","","",""]
[null,null,null,null,null,"",{"$f":"_xlfn.SWITCH(B11,\"(vide)\",\"\",ISBLANK(B11),\"\",B11)","v":0},0,0,null,null,"","","",""]
[null,null,null,null,null,"",{"$f":"_xlfn.SWITCH(B12,\"(vide)\",\"\",ISBLANK(B12),\"\",B12)","v":0},0,0,null,null,"","","",""]
[null,null,null,null,null,"",{"$f":"_xlfn.SWITCH(B13,\"(vide)\",\"\",ISBLANK(B13),\"\",B13)","v":0},0,0,null,null,"","","",""]
[null,null,null,null,null,"",{"$f":"_xlfn.SWITCH(B14,\"(vide)\",\"\",ISBLANK(B14),\"\",B14)","v":0},0,0,null,null,"","","",""]
[null,null,null,null,null,"",{"$f":"_xlfn.SWITCH(B15,\"(vide)\",\"\",ISBLANK(B15),\"\",B15)","v":0},0,0,null,null,"","","",""]
[null,null,null,null,null,"",{"$f":"_xlfn.SWITCH(B16,\"(vide)\",\"\",ISBLANK(B16),\"\",B16)","v":0},0,0,null,null,"","","",""]
[null,null,null,null,null,"",{"$f":"_xlfn.SWITCH(B17,\"(vide)\",\"\",ISBLANK(B17),\"\",B17)","v":0},{"$f":"C17","v":0},0,null,null,"","","",""]
[null,null,null,null,null,"",{"$f":"_xlfn.SWITCH(B18,\"(vide)\",\"\",ISBLANK(B18),\"\",B18)","v":0},0,0,null,null,"","","",""]
[null,null,null,null,null,"",{"$f":"_xlfn.SWITCH(B19,\"(vide)\",\"\",ISBLANK(B19),\"\",B19)","v":0},0,0,null,null,"","","",""]
[null,null,null,null,null,"",{"$f":"_xlfn.SWITCH(B20,\"(vide)\",\"\",ISBLANK(B20),\"\",B20)","v":0},0,0,null,null,"","","",""]
[null,null,null,null,null,"",{"$f":"_xlfn.SWITCH(B21,\"(vide)\",\"\",ISBLANK(B21),\"\",B21)","v":0},0,0,null,null,"","","",""]
[null,null,null,null,null,"",{"$f":"_xlfn.SWITCH(B22,\"(vide)\",\"\",ISBLANK(B22),\"\",B22)","v":0},0,0,null,null,"","","",""]
[null,null,null,null,null,"",{"$f":"_xlfn.SWITCH(B23,\"(vide)\",\"\",ISBLANK(B23),\"\",B23)","v":0},0,0,null,null,"","","",""]
[null,null,null,null,null,"",{"$f":"_xlfn.SWITCH(B24,\"(vide)\",\"\",ISBLANK(B24),\"\",B24)","v":0},0,0,null,null,"","","",""]
[null,null,null,null,null,"",{"$f":"_xlfn.SWITCH(B25,\"(vide)\",\"\",ISBLANK(B25),\"\",B25)","v":0},0,0,null,null,"","","",""]
[null,null,null,null,null,"",{"$f":"_xlfn.SWITCH(B26,\"(vide)\",\"\",ISBLANK(B26),\"\",B26)","v":0},0,0,null,null,"","","",""]
[null,null,null,null,null,"",{"$f":"_xlfn.SWITCH(B27,\"(vide)\",\"\",ISBLANK(B27),\"\",B27)","v":0},0,0,null,null,"","","",""]
[null,null,null,null,null,"",{"$f":"_xlfn.SWITCH(B28,\"(vide)\",\"\",ISBLANK(B28),\"\",B28)","v":0},0,0,null,null,"","","",""]
[null,null,null,null,null,"",{"$f":"_xlfn.SWITCH(B29,\"(vide)\",\"\",ISBLANK(B29),\"\",B29)","v":0},0,0,null,null,"","","",""]
[null,null,null,null,null,"",{"$f":"_xlfn.SWITCH(B30,\"(vide)\",\"\",ISBLANK(B30),\"\",B30)","v":0},0,0,null,null,"","","",""]
[null,null,null,null,null,"",{"$f":"_xlfn.SWITCH(B31,\"(vide)\",\"\",ISBLANK(B31),\"\",B31)","v":0},0,0,null,null,"","","",""]
[null,null,null,null,null,"",{"$f":"_xlfn.SWITCH(B32,\"(vide)\",\"\",ISBLANK(B32),\"\",B32)","v":0},0,0,null,null,"","","",""]
[null,null,null,null,null,"",{"$f":"_xlfn.SWITCH(B33,\"(vide)\",\"\",ISBLANK(B33),\"\",B33)","v":0},0,0,null,null,"","","",""]
[null,null,null,null,null,"",{"$f":"_xlfn.SWITCH(B34,\"(vide)\",\"\",ISBLANK(B34),\"\",B34)","v":0},0,0,null,null,"","","",""]
[null,null,null,null,null,"",{"$f":"_xlfn.SWITCH(B35,\"(vide)\",\"\",ISBLANK(B35),\"\",B35)","v":0},0,0,null,null,"","","",""]
[null,null,null,null,null,"",{"$f":"_xlfn.SWITCH(B36,\"(vide)\",\"\",ISBLANK(B36),\"\",B36)","v":0},0,0,null,null,"","","",""]
[null,null,null,null,null,"",{"$f":"_xlfn.SWITCH(B37,\"(vide)\",\"\",ISBLANK(B37),\"\",B37)","v":0},0,0,null,null,"","","",""]
[null,null,null,null,null,"",{"$f":"_xlfn.SWITCH(B38,\"(vide)\",\"\",ISBLANK(B38),\"\",B38)","v":0},0,0,null,null,"","","",""]
[null,null,null,null,null,"",{"$f":"_xlfn.SWITCH(B39,\"(vide)\",\"\",ISBLANK(B39),\"\",B39)","v":0},0,0,null,null,"","","",""]
[null,null,null,null,null,"",{"$f":"_xlfn.SWITCH(B40,\"(vide)\",\"\",ISBLANK(B40),\"\",B40)","v":0},0,0,null,null,"","","",""]
[null,null,null,null,null,"",{"$f":"_xlfn.SWITCH(B41,\"(vide)\",\"\",ISBLANK(B41),\"\",B41)","v":0},0,0,null,null,"","","",""]
[null,null,null,null,null,"",{"$f":"_xlfn.SWITCH(B42,\"(vide)\",\"\",ISBLANK(B42),\"\",B42)","v":0},0,0,null,null,"","","",""]
[null,null,null,null,null,"",{"$f":"_xlfn.SWITCH(B43,\"(vide)\",\"\",ISBLANK(B43),\"\",B43)","v":0},0,0,null,null,"","","",""]
[null,null,null,null,null,"",{"$f":"_xlfn.SWITCH(B44,\"(vide)\",\"\",ISBLANK(B44),\"\",B44)","v":0},0,0,null,null,"","","",""]
[null,null,null,null,null,"",{"$f":"_xlfn.SWITCH(B45,\"(vide)\",\"\",ISBLANK(B45),\"\",B45)","v":0},0,0,null,null,"","","",""]
[null,null,null,null,null,"",{"$f":"_xlfn.SWITCH(B46,\"(vide)\",\"\",ISBLANK(B46),\"\",B46)","v":0},0,0,null,null,"","","",""]
[null,null,null,null,null,"",{"$f":"_xlfn.SWITCH(B47,\"(vide)\",\"\",ISBLANK(B47),\"\",B47)","v":0},0,0,null,null,"","","",""]
[null,null,null,null,null,"",{"$f":"_xlfn.SWITCH(B48,\"(vide)\",\"\",ISBLANK(B48),\"\",B48)","v":0},0,0,null,null,"","","",""]
[null,null,null,null,null,"",{"$f":"_xlfn.SWITCH(B49,\"(vide)\",\"\",ISBLANK(B49),\"\",B49)","v":0},0,0,null,null,"","","",""]
[null,null,null,null,null,"",{"$f":"_xlfn.SWITCH(B50,\"(vide)\",\"\",ISBLANK(B50),\"\",B50)","v":0},0,0,null,null,"","","",""]
[null,null,null,null,null,"",{"$f":"_xlfn.SWITCH(B51,\"(vide)\",\"\",ISBLANK(B51),\"\",B51)","v":0},0,0,null,null,"","","",""]
[null,null,null,null,null,"",{"$f":"_xlfn.SWITCH(B52,\"(vide)\",\"\",ISBLANK(B52),\"\",B52)","v":0},0,0,null,null,"","","",""]
[null,null,null,null,null,"",{"$f":"_xlfn.SWITCH(B53,\"(vide)\",\"\",ISBLANK(B53),\"\",B53)","v":0},0,0,null,null,"","","",""]
[null,null,null,null,null,"",{"$f":"_xlfn.SWITCH(B54,\"(vide)\",\"\",ISBLANK(B54),\"\",B54)","v":0},0,0,null,null,"","","",""]
[null,null,null,null,null,"",{"$f":"_xlfn.SWITCH(B55,\"(vide)\",\"\",ISBLANK(B55),\"\",B55)","v":0},0,0,null,null,"","","",""]
[null,null,null,null,null,"",{"$f":"_xlfn.SWITCH(B56,\"(vide)\",\"\",ISBLANK(B56),\"\",B56)","v":0},0,0,null,null,"","","",""]
[null,null,null,null,null,"",{"$f":"_xlfn.SWITCH(B57,\"(vide)\",\"\",ISBLANK(B57),\"\",B57)","v":0},0,0,null,null,"","","",""]
[null,null,null,null,null,"",{"$f":"_xlfn.SWITCH(B58,\"(vide)\",\"\",ISBLANK(B58),\"\",B58)","v":0},0,0,null,null,"","","",""]
[null,null,null,null,null,"",{"$f":"_xlfn.SWITCH(B59,\"(vide)\",\"\",ISBLANK(B59),\"\",B59)","v":0},0,0,null,null,"","","",""]
[null,null,null,null,null,"",{"$f":"_xlfn.SWITCH(B60,\"(vide)\",\"\",ISBLANK(B60),\"\",B60)","v":0},0,0,null,null,"","","",""]
[null,null,null,null,null,"",{"$f":"_xlfn.SWITCH(B61,\"(vide)\",\"\",ISBLANK(B61),\"\",B61)","v":0},0,0,null,null,"","","",""]
[null,null,null,null,null,"",{"$f":"_xlfn.SWITCH(B62,\"(vide)\",\"\",ISBLANK(B62),\"\",B62)","v":0},0,0,null,null,"","","",""]
[null,null,null,null,null,"",{"$f":"_xlfn.SWITCH(B63,\"(vide)\",\"\",ISBLANK(B63),\"\",B63)","v":0},0,0,null,null,"","","",""]
[null,null,null,null,null,"",{"$f":"_xlfn.SWITCH(B64,\"(vide)\",\"\",ISBLANK(B64),\"\",B64)","v":0},0,0,null,null,"","","",""]
[null,null,null,null,null,"",{"$f":"_xlfn.SWITCH(B65,\"(vide)\",\"\",ISBLANK(B65),\"\",B65)","v":0},0,0,null,null,"","","",""]
[null,null,null,null,null,"",{"$f":"_xlfn.SWITCH(B66,\"(vide)\",\"\",ISBLANK(B66),\"\",B66)","v":0},0,0,null,null,"","","",""]
[null,null,null,null,null,{"$f":"IF(A67=\"\",\"\",A67)","v":""},{"$f":"_xlfn.SWITCH(B67,\"(vide)\",\"\",ISBLANK(B67),\"\",B67)","v":0},0,0,null,null,"","","",{"$f":"IF(I67=0,\"\",I67)","v":""}]
[null,null,null,null,null,"",{"$f":"_xlfn.SWITCH(B68,\"(vide)\",\"\",ISBLANK(B68),\"\",B68)","v":0},0,0,null,null,{"$f":"IF(F68=0,\"\",F68)","v":""},"","",""]
[null,null,null,null,null,"",{"$f":"_xlfn.SWITCH(B69,\"(vide)\",\"\",ISBLANK(B69),\"\",B69)","v":0},0,0,null,null,"","","",""]
[null,null,null,null,null,"",{"$f":"_xlfn.SWITCH(B70,\"(vide)\",\"\",ISBLANK(B70),\"\",B70)","v":0},0,0,null,null,"","","",""]
[null,null,null,null,null,"",{"$f":"_xlfn.SWITCH(B71,\"(vide)\",\"\",ISBLANK(B71),\"\",B71)","v":0},0,0,null,null,"","","",""]
[null,null,null,null,null,"",{"$f":"_xlfn.SWITCH(B72,\"(vide)\",\"\",ISBLANK(B72),\"\",B72)","v":0},0,0,null,null,"","","",""]
[null,null,null,null,null,"",{"$f":"_xlfn.SWITCH(B73,\"(vide)\",\"\",ISBLANK(B73),\"\",B73)","v":0},0,0,null,null,"","","",""]
[null,null,null,null,null,"",{"$f":"_xlfn.SWITCH(B74,\"(vide)\",\"\",ISBLANK(B74),\"\",B74)","v":0},0,0,null,null,"","","",""]
[null,null,null,null,null,"",{"$f":"_xlfn.SWITCH(B75,\"(vide)\",\"\",ISBLANK(B75),\"\",B75)","v":0},0,0,null,null,"","","",""]
[null,null,null,null,null,"",{"$f":"_xlfn.SWITCH(B76,\"(vide)\",\"\",ISBLANK(B76),\"\",B76)","v":0},0,0,null,null,"","","",""]
[null,null,null,null,null,"",{"$f":"_xlfn.SWITCH(B77,\"(vide)\",\"\",ISBLANK(B77),\"\",B77)","v":0},0,0,null,null,"","","",""]
[null,null,null,null,null,"",{"$f":"_xlfn.SWITCH(B78,\"(vide)\",\"\",ISBLANK(B78),\"\",B78)","v":0},0,0,null,null,"","","",""]
[null,null,null,null,null,"",{"$f":"_xlfn.SWITCH(B79,\"(vide)\",\"\",ISBLANK(B79),\"\",B79)","v":0},0,0,null,null,"","","",""]
[null,null,null,null,null,"",{"$f":"_xlfn.SWITCH(B80,\"(vide)\",\"\",ISBLANK(B80),\"\",B80)","v":0},0,0,null,null,"","","",""]
[null,null,null,null,null,"",{"$f":"_xlfn.SWITCH(B81,\"(vide)\",\"\",ISBLANK(B81),\"\",B81)","v":0},{"$f":"C81","v":0},0,null,null,"","","",""]
[null,null,null,null,null,"",{"$f":"_xlfn.SWITCH(B82,\"(vide)\",\"\",ISBLANK(B82),\"\",B82)","v":0},0,0,null,null,"","","",""]
[null,null,null,null,null,"",{"$f":"_xlfn.SWITCH(B83,\"(vide)\",\"\",ISBLANK(B83),\"\",B83)","v":0},0,0,null,null,"","","",""]
[null,null,null,null,null,"",{"$f":"_xlfn.SWITCH(B84,\"(vide)\",\"\",ISBLANK(B84),\"\",B84)","v":0},0,0,null,null,"","","",""]
[null,null,null,null,null,"",{"$f":"_xlfn.SWITCH(B85,\"(vide)\",\"\",ISBLANK(B85),\"\",B85)","v":0},0,0,null,null,"","","",""]
[null,null,null,null,null,"",{"$f":"_xlfn.SWITCH(B86,\"(vide)\",\"\",ISBLANK(B86),\"\",B86)","v":0},0,0,null,null,"","","",""]
[null,null,null,null,null,"",{"$f":"_xlfn.SWITCH(B87,\"(vide)\",\"\",ISBLANK(B87),\"\",B87)","v":0},0,0,null,null,"","","",""]
[null,null,null,null,null,"",{"$f":"_xlfn.SWITCH(B88,\"(vide)\",\"\",ISBLANK(B88),\"\",B88)","v":0},0,0,null,null,"","","",""]
[null,null,null,null,null,"",{"$f":"_xlfn.SWITCH(B89,\"(vide)\",\"\",ISBLANK(B89),\"\",B89)","v":0},0,0,null,null,"","","",""]
[null,null,null,null,null,"",{"$f":"_xlfn.SWITCH(B90,\"(vide)\",\"\",ISBLANK(B90),\"\",B90)","v":0},0,0,null,null,"","","",""]
[null,null,null,null,null,"",{"$f":"_xlfn.SWITCH(B91,\"(vide)\",\"\",ISBLANK(B91),\"\",B91)","v":0},0,0,null,null,"","","",""]
[null,null,null,null,null,"",{"$f":"_xlfn.SWITCH(B92,\"(vide)\",\"\",ISBLANK(B92),\"\",B92)","v":0},0,0,null,null,"","","",""]
[null,null,null,null,null,"",{"$f":"_xlfn.SWITCH(B93,\"(vide)\",\"\",ISBLANK(B93),\"\",B93)","v":0},0,0,null,null,"","","",""]
[null,null,null,null,null,"",{"$f":"_xlfn.SWITCH(B94,\"(vide)\",\"\",ISBLANK(B94),\"\",B94)","v":0},0,0,null,null,"","","",""]
[null,null,null,null,null,"",{"$f":"_xlfn.SWITCH(B95,\"(vide)\",\"\",ISBLANK(B95),\"\",B95)","v":0},0,0,null,null,"","","",""]
[null,null,null,null,null,"",{"$f":"_xlfn.SWITCH(B96,\"(vide)\",\"\",ISBLANK(B96),\"\",B96)","v":0},0,0,null,null,"","","",""]
[null,null,null,null,null,"",{"$f":"_xlfn.SWITCH(B97,\"(vide)\",\"\",ISBLANK(B97),\"\",B97)","v":0},0,0,null,null,"","","",""]
[null,null,null,null,null,"",{"$f":"_xlfn.SWITCH(B98,\"(vide)\",\"\",ISBLANK(B98),\"\",B98)","v":0},0,0,null,null,"","","",""]
[null,null,null,null,null,"",{"$f":"_xlfn.SWITCH(B99,\"(vide)\",\"\",ISBLANK(B99),\"\",B99)","v":0},0,0,null,null,"","","",""]
[null,null,null,null,null,"",{"$f":"_xlfn.SWITCH(B100,\"(vide)\",\"\",ISBLANK(B100),\"\",B100)","v":0},0,0,null,null,"","","",""]
[null,null,null,null,null,"",{"$f":"_xlfn.SWITCH(B101,\"(vide)\",\"\",ISBLANK(B101),\"\",B101)","v":0},0,0,null,null,"","","",""]
[null,null,null,null,null,"",{"$f":"_xlfn.SWITCH(B102,\"(vide)\",\"\",ISBLANK(B102),\"\",B102)","v":0},0,0,null,null,"","","",""]
[null,null,null,null,null,"",{"$f":"_xlfn.SWITCH(B103,\"(vide)\",\"\",ISBLANK(B103),\"\",B103)","v":0},0,0,null,null,"","","",""]
[null,null,null,null,null,"",{"$f":"_xlfn.SWITCH(B104,\"(vide)\",\"\",ISBLANK(B104),\"\",B104)","v":0},0,0,null,null,"","","",""]
[null,null,null,null,null,"",{"$f":"_xlfn.SWITCH(B105,\"(vide)\",\"\",ISBLANK(B105),\"\",B105)","v":0},0,0,null,null,"","","",""]
[null,null,null,null,null,"",{"$f":"_xlfn.SWITCH(B106,\"(vide)\",\"\",ISBLANK(B106),\"\",B106)","v":0},0,0,null,null,"","","",""]
[null,null,null,null,null,"",{"$f":"_xlfn.SWITCH(B107,\"(vide)\",\"\",ISBLANK(B107),\"\",B107)","v":0},0,0,null,null,"","","",""]
[null,null,null,null,null,"",{"$f":"_xlfn.SWITCH(B108,\"(vide)\",\"\",ISBLANK(B108),\"\",B108)","v":0},0,0,null,null,"","","",""]
[null,null,null,null,null,"",{"$f":"_xlfn.SWITCH(B109,\"(vide)\",\"\",ISBLANK(B109),\"\",B109)","v":0},0,0,null,null,"","","",""]
[null,null,null,null,null,"",{"$f":"_xlfn.SWITCH(B110,\"(vide)\",\"\",ISBLANK(B110),\"\",B110)","v":0},0,0,null,null,"","","",""]
[null,null,null,null,null,"",{"$f":"_xlfn.SWITCH(B111,\"(vide)\",\"\",ISBLANK(B111),\"\",B111)","v":0},0,0,null,null,"","","",""]
[null,null,null,null,null,"",{"$f":"_xlfn.SWITCH(B112,\"(vide)\",\"\",ISBLANK(B112),\"\",B112)","v":0},0,0,null,null,"","","",""]
[null,null,null,null,null,"",{"$f":"_xlfn.SWITCH(B113,\"(vide)\",\"\",ISBLANK(B113),\"\",B113)","v":0},0,0,null,null,"","","",""]
[null,null,null,null,null,"",{"$f":"_xlfn.SWITCH(B114,\"(vide)\",\"\",ISBLANK(B114),\"\",B114)","v":0},0,0,null,null,"","","",""]
[null,null,null,null,null,"",{"$f":"_xlfn.SWITCH(B115,\"(vide)\",\"\",ISBLANK(B115),\"\",B115)","v":0},0,0,null,null,"","","",""]
[null,null,null,null,null,"",{"$f":"_xlfn.SWITCH(B116,\"(vide)\",\"\",ISBLANK(B116),\"\",B116)","v":0},0,0,null,null,"","","",""]
[null,null,null,null,null,"",{"$f":"_xlfn.SWITCH(B117,\"(vide)\",\"\",ISBLANK(B117),\"\",B117)","v":0},0,0,null,null,"","","",""]
[null,null,null,null,null,"",{"$f":"_xlfn.SWITCH(B118,\"(vide)\",\"\",ISBLANK(B118),\"\",B118)","v":0},0,0,null,null,"","","",""]
[null,null,null,null,null,"",{"$f":"_xlfn.SWITCH(B119,\"(vide)\",\"\",ISBLANK(B119),\"\",B119)","v":0},0,0,null,null,"","","",""]
[null,null,null,null,null,"",{"$f":"_xlfn.SWITCH(B120,\"(vide)\",\"\",ISBLANK(B120),\"\",B120)","v":0},0,0,null,null,"","","",""]
[null,null,null,null,null,"",{"$f":"_xlfn.SWITCH(B121,\"(vide)\",\"\",ISBLANK(B121),\"\",B121)","v":0},0,0,null,null,"","","",""]
[null,null,null,null,null,"",{"$f":"_xlfn.SWITCH(B122,\"(vide)\",\"\",ISBLANK(B122),\"\",B122)","v":0},0,0,null,null,"","","",""]
[null,null,null,null,null,"",{"$f":"_xlfn.SWITCH(B123,\"(vide)\",\"\",ISBLANK(B123),\"\",B123)","v":0},0,0,null,null,"","","",""]
[null,null,null,null,null,"",{"$f":"_xlfn.SWITCH(B124,\"(vide)\",\"\",ISBLANK(B124),\"\",B124)","v":0},0,0,null,null,"","","",""]
[null,null,null,null,null,"",{"$f":"_xlfn.SWITCH(B125,\"(vide)\",\"\",ISBLANK(B125),\"\",B125)","v":0},0,0,null,null,"","","",""]
[null,null,null,null,null,"",{"$f":"_xlfn.SWITCH(B126,\"(vide)\",\"\",ISBLANK(B126),\"\",B126)","v":0},0,0,null,null,"","","",""]
[null,null,null,null,null,"",{"$f":"_xlfn.SWITCH(B127,\"(vide)\",\"\",ISBLANK(B127),\"\",B127)","v":0},0,0,null,null,"","","",""]
[null,null,null,null,null,"",{"$f":"_xlfn.SWITCH(B128,\"(vide)\",\"\",ISBLANK(B128),\"\",B128)","v":0},0,0,null,null,"","","",""]
[null,null,null,null,null,"",{"$f":"_xlfn.SWITCH(B129,\"(vide)\",\"\",ISBLANK(B129),\"\",B129)","v":0},0,0,null,null,"","","",""]
[null,null,null,null,null,"",{"$f":"_xlfn.SWITCH(B130,\"(vide)\",\"\",ISBLANK(B130),\"\",B130)","v":0},0,0,null,null,"","","",""]
[null,null,null,null,null,{"$f":"IF(A131=\"\",\"\",A131)","v":""},{"$f":"_xlfn.SWITCH(B131,\"(vide)\",\"\",ISBLANK(B131),\"\",B131)","v":0},0,0,null,null,"","","",""]
[null,null,null,null,null,"",{"$f":"_xlfn.SWITCH(B132,\"(vide)\",\"\",ISBLANK(B132),\"\",B132)","v":0},0,0,null,null,{"$f":"IF(F132=0,\"\",F132)","v":""},"","",""]
[null,null,null,null,null,"",{"$f":"_xlfn.SWITCH(B133,\"(vide)\",\"\",ISBLANK(B133),\"\",B133)","v":0},0,0,null,null,"","","",""]
[null,null,null,null,null,"",{"$f":"_xlfn.SWITCH(B134,\"(vide)\",\"\",ISBLANK(B134),\"\",B134)","v":0},0,0,null,null,"","","",""]
[null,null,null,null,null,"",{"$f":"_xlfn.SWITCH(B135,\"(vide)\",\"\",ISBLANK(B135),\"\",B135)","v":0},0,0,null,null,"","","",""]
[null,null,null,null,null,"",{"$f":"_xlfn.SWITCH(B136,\"(vide)\",\"\",ISBLANK(B136),\"\",B136)","v":0},0,0,null,null,"","","",""]
[null,null,null,null,null,"",{"$f":"_xlfn.SWITCH(B137,\"(vide)\",\"\",ISBLANK(B137),\"\",B137)","v":0},0,0,null,null,"","","",""]
[null,null,null,null,null,"",{"$f":"_xlfn.SWITCH(B138,\"(vide)\",\"\",ISBLANK(B138),\"\",B138)","v":0},0,0,null,null,"","","",""]
[null,null,null,null,null,"",{"$f":"_xlfn.SWITCH(B139,\"(vide)\",\"\",ISBLANK(B139),\"\",B139)","v":0},0,0,null,null,"","","",""]
[null,null,null,null,null,"",{"$f":"_xlfn.SWITCH(B140,\"(vide)\",\"\",ISBLANK(B140),\"\",B140)","v":0},0,0,null,null,"","","",""]
[null,null,null,null,null,"",{"$f":"_xlfn.SWITCH(B141,\"(vide)\",\"\",ISBLANK(B141),\"\",B141)","v":0},0,0,null,null,"","","",""]
[null,null,null,null,null,"",{"$f":"_xlfn.SWITCH(B142,\"(vide)\",\"\",ISBLANK(B142),\"\",B142)","v":0},0,0,null,null,"","","",""]

{"sheet":"BFC","index":7,"n_rows":1,"n_cols":1,"rows_kept":1,"cut":false,"hidden":false,"merged":[[0,0,2,22]]}
["REGION\nBOURGOGNE-FRANCHE-COMTE"]

{"sheet":"Bretagne TCD","index":8,"n_rows":142,"n_cols":15,"rows_kept":142,"cut":false,"hidden":true,"merged":[]}
["Pays","Provinces","Départements","CENTRE",null,{"$f":"A1","v":"Pays"},{"$f":"B1","v":"Provinces"},{"$f":"C1","v":"Départements"},"CENTRE",null,null,{"$f":"IF(F1=0,\"\",F1)","v":"Pays"},"Provinces","Départements","CENTRE"]
["France","Bretagne","Côtes-d'Armor","Loudéac",null,{"$f":"IF(A2=\"\",\"\",A2)","v":"France"},{"$f":"IF(B2=\"(vide)\",\"\",B2)","v":"Bretagne"},{"$f":"C2","v":"Côtes-d'Armor"},"Loudéac",null,null,"France","Bretagne","Côtes-d'Armor","Loudéac"]
["France","Bretagne","Côtes-d'Armor","Saint Brieuc Langueux",null,{"$f":"IF(A3=\"\",\"\",A3)","v":"France"},{"$f":"IF(B3=\"(vide)\",\"\",B3)","v":"Bretagne"},{"$f":"C3","v":"Côtes-d'Armor"},"Saint Brieuc Langueux",null,null,{"$f":"IF(F3=0,\"\",F3)","v":"France"},{"$f":"IF(G3=0,\"\",G3)","v":"Bretagne"},{"$f":"IF(H3=0,\"\",H3)","v":"Côtes-d'Armor"},{"$f":"IF(I3=0,\"\",I3)","v":"Saint Brieuc Langueux"}]
["France","Bretagne","Finistère","Brest",null,"France","Bretagne","Finistère","Brest",null,null,{"$f":"IF(F4=0,\"\",F4)","v":"France"},"Bretagne","Finistère","Brest"]
["France","Bretagne","Finistère","Morlaix",null,"France",{"$f":"_xlfn.SWITCH(B5,\"(vide)\",\"\",ISBLANK(B5),\"\",B5)","v":"Bretagne"},"Finistère","Morlaix",null,null,"France","Bretagne","Finistère","Morlaix"]
["France","Bretagne","Finistère","Quimper",null,"France",{"$f":"_xlfn.SWITCH(B6,\"(vide)\",\"\",ISBLANK(B6),\"\",B6)","v":"Bretagne"},"Finistère","Quimper",null,null,"France","Bretagne","Finistère","Quimper"]
["France","Bretagne","Ille-et-Vilaine","Rennes",null,"France",{"$f":"_xlfn.SWITCH(B7,\"(vide)\",\"\",ISBLANK(B7),\"\",B7)","v":"Bretagne"},"Ille-et-Vilaine","Rennes",null,null,"France","Bretagne","Ille-et-Vilaine","Rennes"]
["France","Bretagne","Ille-et-Vilaine","Saint Malo",null,"France",{"$f":"_xlfn.SWITCH(B8,\"(vide)\",\"\",ISBLANK(B8),\"\",B8)","v":"Bretagne"},"Ille-et-Vilaine","Saint Malo",null,null,"France","Bretagne","Ille-et-Vilaine","Saint Malo"]
["France","Bretagne","Morbihan","Auray Kervhal en Brech",null,"France",{"$f":"_xlfn.SWITCH(B9,\"(vide)\",\"\",ISBLANK(B9),\"\",B9)","v":"Bretagne"},"Morbihan","Auray Kervhal en Brech",null,null,"France","Bretagne","Morbihan","Auray Kervhal en Brech"]
["France","Bretagne","Morbihan","Lorient",null,"France",{"$f":"_xlfn.SWITCH(B10,\"(vide)\",\"\",ISBLANK(B10),\"\",B10)","v":"Bretagne"},"Morbihan","Lorient",null,null,"France","Bretagne","Morbihan","Lorient"]
[null,null,null,null,null,"",{"$f":"_xlfn.SWITCH(B11,\"(vide)\",\"\",ISBLANK(B11),\"\",B11)","v":0},0,0,null,null,"","","",""]
[null,null,null,null,null,"",{"$f":"_xlfn.SWITCH(B12,\"(vide)\",\"\",ISBLANK(B12),\"\",B12)","v":0},0,0,null,null,"","","",""]
[null,null,null,null,null,"",{"$f":"_xlfn.SWITCH(B13,\"(vide)\",\"\",ISBLANK(B13),\"\",B13)","v":0},0,0,null,null,"","","",""]
[null,null,null,null,null,"",{"$f":"_xlfn.SWITCH(B14,\"(vide)\",\"\",ISBLANK(B14),\"\",B14)","v":0},0,0,null,null,"","","",""]
[null,null,null,null,null,"",{"$f":"_xlfn.SWITCH(B15,\"(vide)\",\"\",ISBLANK(B15),\"\",B15)","v":0},0,0,null,null,"","","",""]
[null,null,null,null,null,"",{"$f":"_xlfn.SWITCH(B16,\"(vide)\",\"\",ISBLANK(B16),\"\",B16)","v":0},0,0,null,null,"","","",""]
[null,null,null,null,null,"",{"$f":"_xlfn.SWITCH(B17,\"(vide)\",\"\",ISBLANK(B17),\"\",B17)","v":0},{"$f":"C17","v":0},0,null,null,"","","",""]
[null,null,null,null,null,"",{"$f":"_xlfn.SWITCH(B18,\"(vide)\",\"\",ISBLANK(B18),\"\",B18)","v":0},0,0,null,null,"","","",""]
[null,null,null,null,null,"",{"$f":"_xlfn.SWITCH(B19,\"(vide)\",\"\",ISBLANK(B19),\"\",B19)","v":0},0,0,null,null,"","","",""]
[null,null,null,null,null,"",{"$f":"_xlfn.SWITCH(B20,\"(vide)\",\"\",ISBLANK(B20),\"\",B20)","v":0},0,0,null,null,"","","",""]
[null,null,null,null,null,"",{"$f":"_xlfn.SWITCH(B21,\"(vide)\",\"\",ISBLANK(B21),\"\",B21)","v":0},0,0,null,null,"","","",""]
[null,null,null,null,null,"",{"$f":"_xlfn.SWITCH(B22,\"(vide)\",\"\",ISBLANK(B22),\"\",B22)","v":0},0,0,null,null,"","","",""]
[null,null,null,null,null,"",{"$f":"_xlfn.SWITCH(B23,\"(vide)\",\"\",ISBLANK(B23),\"\",B23)","v":0},0,0,null,null,"","","",""]
[null,null,null,null,null,"",{"$f":"_xlfn.SWITCH(B24,\"(vide)\",\"\",ISBLANK(B24),\"\",B24)","v":0},0,0,null,null,"","","",""]
[null,null,null,null,null,"",{"$f":"_xlfn.SWITCH(B25,\"(vide)\",\"\",ISBLANK(B25),\"\",B25)","v":0},0,0,null,null,"","","",""]
[null,null,null,null,null,"",{"$f":"_xlfn.SWITCH(B26,\"(vide)\",\"\",ISBLANK(B26),\"\",B26)","v":0},0,0,null,null,"","","",""]
[null,null,null,null,null,"",{"$f":"_xlfn.SWITCH(B27,\"(vide)\",\"\",ISBLANK(B27),\"\",B27)","v":0},0,0,null,null,"","","",""]
[null,null,null,null,null,"",{"$f":"_xlfn.SWITCH(B28,\"(vide)\",\"\",ISBLANK(B28),\"\",B28)","v":0},0,0,null,null,"","","",""]
[null,null,null,null,null,"",{"$f":"_xlfn.SWITCH(B29,\"(vide)\",\"\",ISBLANK(B29),\"\",B29)","v":0},0,0,null,null,"","","",""]
[null,null,null,null,null,"",{"$f":"_xlfn.SWITCH(B30,\"(vide)\",\"\",ISBLANK(B30),\"\",B30)","v":0},0,0,null,null,"","","",""]
[null,null,null,null,null,"",{"$f":"_xlfn.SWITCH(B31,\"(vide)\",\"\",ISBLANK(B31),\"\",B31)","v":0},0,0,null,null,"","","",""]
[null,null,null,null,null,"",{"$f":"_xlfn.SWITCH(B32,\"(vide)\",\"\",ISBLANK(B32),\"\",B32)","v":0},0,0,null,null,"","","",""]
[null,null,null,null,null,"",{"$f":"_xlfn.SWITCH(B33,\"(vide)\",\"\",ISBLANK(B33),\"\",B33)","v":0},0,0,null,null,"","","",""]
[null,null,null,null,null,"",{"$f":"_xlfn.SWITCH(B34,\"(vide)\",\"\",ISBLANK(B34),\"\",B34)","v":0},0,0,null,null,"","","",""]
[null,null,null,null,null,"",{"$f":"_xlfn.SWITCH(B35,\"(vide)\",\"\",ISBLANK(B35),\"\",B35)","v":0},0,0,null,null,"","","",""]
[null,null,null,null,null,"",{"$f":"_xlfn.SWITCH(B36,\"(vide)\",\"\",ISBLANK(B36),\"\",B36)","v":0},0,0,null,null,"","","",""]
[null,null,null,null,null,"",{"$f":"_xlfn.SWITCH(B37,\"(vide)\",\"\",ISBLANK(B37),\"\",B37)","v":0},0,0,null,null,"","","",""]
[null,null,null,null,null,"",{"$f":"_xlfn.SWITCH(B38,\"(vide)\",\"\",ISBLANK(B38),\"\",B38)","v":0},0,0,null,null,"","","",""]
[null,null,null,null,null,"",{"$f":"_xlfn.SWITCH(B39,\"(vide)\",\"\",ISBLANK(B39),\"\",B39)","v":0},0,0,null,null,"","","",""]
[null,null,null,null,null,"",{"$f":"_xlfn.SWITCH(B40,\"(vide)\",\"\",ISBLANK(B40),\"\",B40)","v":0},0,0,null,null,"","","",""]
[null,null,null,null,null,"",{"$f":"_xlfn.SWITCH(B41,\"(vide)\",\"\",ISBLANK(B41),\"\",B41)","v":0},0,0,null,null,"","","",""]
[null,null,null,null,null,"",{"$f":"_xlfn.SWITCH(B42,\"(vide)\",\"\",ISBLANK(B42),\"\",B42)","v":0},0,0,null,null,"","","",""]
[null,null,null,null,null,"",{"$f":"_xlfn.SWITCH(B43,\"(vide)\",\"\",ISBLANK(B43),\"\",B43)","v":0},0,0,null,null,"","","",""]
[null,null,null,null,null,"",{"$f":"_xlfn.SWITCH(B44,\"(vide)\",\"\",ISBLANK(B44),\"\",B44)","v":0},0,0,null,null,"","","",""]
[null,null,null,null,null,"",{"$f":"_xlfn.SWITCH(B45,\"(vide)\",\"\",ISBLANK(B45),\"\",B45)","v":0},0,0,null,null,"","","",""]
[null,null,null,null,null,"",{"$f":"_xlfn.SWITCH(B46,\"(vide)\",\"\",ISBLANK(B46),\"\",B46)","v":0},0,0,null,null,"","","",""]
[null,null,null,null,null,"",{"$f":"_xlfn.SWITCH(B47,\"(vide)\",\"\",ISBLANK(B47),\"\",B47)","v":0},0,0,null,null,"","","",""]
[null,null,null,null,null,"",{"$f":"_xlfn.SWITCH(B48,\"(vide)\",\"\",ISBLANK(B48),\"\",B48)","v":0},0,0,null,null,"","","",""]
[null,null,null,null,null,"",{"$f":"_xlfn.SWITCH(B49,\"(vide)\",\"\",ISBLANK(B49),\"\",B49)","v":0},0,0,null,null,"","","",""]
[null,null,null,null,null,"",{"$f":"_xlfn.SWITCH(B50,\"(vide)\",\"\",ISBLANK(B50),\"\",B50)","v":0},0,0,null,null,"","","",""]
[null,null,null,null,null,"",{"$f":"_xlfn.SWITCH(B51,\"(vide)\",\"\",ISBLANK(B51),\"\",B51)","v":0},0,0,null,null,"","","",""]
[null,null,null,null,null,"",{"$f":"_xlfn.SWITCH(B52,\"(vide)\",\"\",ISBLANK(B52),\"\",B52)","v":0},0,0,null,null,"","","",""]
[null,null,null,null,null,"",{"$f":"_xlfn.SWITCH(B53,\"(vide)\",\"\",ISBLANK(B53),\"\",B53)","v":0},0,0,null,null,"","","",""]
[null,null,null,null,null,"",{"$f":"_xlfn.SWITCH(B54,\"(vide)\",\"\",ISBLANK(B54),\"\",B54)","v":0},0,0,null,null,"","","",""]
[null,null,null,null,null,"",{"$f":"_xlfn.SWITCH(B55,\"(vide)\",\"\",ISBLANK(B55),\"\",B55)","v":0},0,0,null,null,"","","",""]
[null,null,null,null,null,"",{"$f":"_xlfn.SWITCH(B56,\"(vide)\",\"\",ISBLANK(B56),\"\",B56)","v":0},0,0,null,null,"","","",""]
[null,null,null,null,null,"",{"$f":"_xlfn.SWITCH(B57,\"(vide)\",\"\",ISBLANK(B57),\"\",B57)","v":0},0,0,null,null,"","","",""]
[null,null,null,null,null,"",{"$f":"_xlfn.SWITCH(B58,\"(vide)\",\"\",ISBLANK(B58),\"\",B58)","v":0},0,0,null,null,"","","",""]
[null,null,null,null,null,"",{"$f":"_xlfn.SWITCH(B59,\"(vide)\",\"\",ISBLANK(B59),\"\",B59)","v":0},0,0,null,null,"","","",""]
[null,null,null,null,null,"",{"$f":"_xlfn.SWITCH(B60,\"(vide)\",\"\",ISBLANK(B60),\"\",B60)","v":0},0,0,null,null,"","","",""]
[null,null,null,null,null,"",{"$f":"_xlfn.SWITCH(B61,\"(vide)\",\"\",ISBLANK(B61),\"\",B61)","v":0},0,0,null,null,"","","",""]
[null,null,null,null,null,"",{"$f":"_xlfn.SWITCH(B62,\"(vide)\",\"\",ISBLANK(B62),\"\",B62)","v":0},0,0,null,null,"","","",""]
[null,null,null,null,null,"",{"$f":"_xlfn.SWITCH(B63,\"(vide)\",\"\",ISBLANK(B63),\"\",B63)","v":0},0,0,null,null,"","","",""]
[null,null,null,null,null,"",{"$f":"_xlfn.SWITCH(B64,\"(vide)\",\"\",ISBLANK(B64),\"\",B64)","v":0},0,0,null,null,"","","",""]
[null,null,null,null,null,"",{"$f":"_xlfn.SWITCH(B65,\"(vide)\",\"\",ISBLANK(B65),\"\",B65)","v":0},0,0,null,null,"","","",""]
[null,null,null,null,null,"",{"$f":"_xlfn.SWITCH(B66,\"(vide)\",\"\",ISBLANK(B66),\"\",B66)","v":0},0,0,null,null,"","","",""]
[null,null,null,null,null,{"$f":"IF(A67=\"\",\"\",A67)","v":""},{"$f":"_xlfn.SWITCH(B67,\"(vide)\",\"\",ISBLANK(B67),\"\",B67)","v":0},0,0,null,null,"","","",{"$f":"IF(I67=0,\"\",I67)","v":""}]
[null,null,null,null,null,"",{"$f":"_xlfn.SWITCH(B68,\"(vide)\",\"\",ISBLANK(B68),\"\",B68)","v":0},0,0,null,null,{"$f":"IF(F68=0,\"\",F68)","v":""},"","",""]
[null,null,null,null,null,"",{"$f":"_xlfn.SWITCH(B69,\"(vide)\",\"\",ISBLANK(B69),\"\",B69)","v":0},0,0,null,null,"","","",""]
[null,null,null,null,null,"",{"$f":"_xlfn.SWITCH(B70,\"(vide)\",\"\",ISBLANK(B70),\"\",B70)","v":0},0,0,null,null,"","","",""]
[null,null,null,null,null,"",{"$f":"_xlfn.SWITCH(B71,\"(vide)\",\"\",ISBLANK(B71),\"\",B71)","v":0},0,0,null,null,"","","",""]
[null,null,null,null,null,"",{"$f":"_xlfn.SWITCH(B72,\"(vide)\",\"\",ISBLANK(B72),\"\",B72)","v":0},0,0,null,null,"","","",""]
[null,null,null,null,null,"",{"$f":"_xlfn.SWITCH(B73,\"(vide)\",\"\",ISBLANK(B73),\"\",B73)","v":0},0,0,null,null,"","","",""]
[null,null,null,null,null,"",{"$f":"_xlfn.SWITCH(B74,\"(vide)\",\"\",ISBLANK(B74),\"\",B74)","v":0},0,0,null,null,"","","",""]
[null,null,null,null,null,"",{"$f":"_xlfn.SWITCH(B75,\"(vide)\",\"\",ISBLANK(B75),\"\",B75)","v":0},0,0,null,null,"","","",""]
[null,null,null,null,null,"",{"$f":"_xlfn.SWITCH(B76,\"(vide)\",\"\",ISBLANK(B76),\"\",B76)","v":0},0,0,null,null,"","","",""]
[null,null,null,null,null,"",{"$f":"_xlfn.SWITCH(B77,\"(vide)\",\"\",ISBLANK(B77),\"\",B77)","v":0},0,0,null,null,"","","",""]
[null,null,null,null,null,"",{"$f":"_xlfn.SWITCH(B78,\"(vide)\",\"\",ISBLANK(B78),\"\",B78)","v":0},0,0,null,null,"","","",""]
[null,null,null,null,null,"",{"$f":"_xlfn.SWITCH(B79,\"(vide)\",\"\",ISBLANK(B79),\"\",B79)","v":0},0,0,null,null,"","","",""]
[null,null,null,null,null,"",{"$f":"_xlfn.SWITCH(B80,\"(vide)\",\"\",ISBLANK(B80),\"\",B80)","v":0},0,0,null,null,"","","",""]
[null,null,null,null,null,"",{"$f":"_xlfn.SWITCH(B81,\"(vide)\",\"\",ISBLANK(B81),\"\",B81)","v":0},{"$f":"C81","v":0},0,null,null,"","","",""]
[null,null,null,null,null,"",{"$f":"_xlfn.SWITCH(B82,\"(vide)\",\"\",ISBLANK(B82),\"\",B82)","v":0},0,0,null,null,"","","",""]
[null,null,null,null,null,"",{"$f":"_xlfn.SWITCH(B83,\"(vide)\",\"\",ISBLANK(B83),\"\",B83)","v":0},0,0,null,null,"","","",""]
[null,null,null,null,null,"",{"$f":"_xlfn.SWITCH(B84,\"(vide)\",\"\",ISBLANK(B84),\"\",B84)","v":0},0,0,null,null,"","","",""]
[null,null,null,null,null,"",{"$f":"_xlfn.SWITCH(B85,\"(vide)\",\"\",ISBLANK(B85),\"\",B85)","v":0},0,0,null,null,"","","",""]
[null,null,null,null,null,"",{"$f":"_xlfn.SWITCH(B86,\"(vide)\",\"\",ISBLANK(B86),\"\",B86)","v":0},0,0,null,null,"","","",""]
[null,null,null,null,null,"",{"$f":"_xlfn.SWITCH(B87,\"(vide)\",\"\",ISBLANK(B87),\"\",B87)","v":0},0,0,null,null,"","","",""]
[null,null,null,null,null,"",{"$f":"_xlfn.SWITCH(B88,\"(vide)\",\"\",ISBLANK(B88),\"\",B88)","v":0},0,0,null,null,"","","",""]
[null,null,null,null,null,"",{"$f":"_xlfn.SWITCH(B89,\"(vide)\",\"\",ISBLANK(B89),\"\",B89)","v":0},0,0,null,null,"","","",""]
[null,null,null,null,null,"",{"$f":"_xlfn.SWITCH(B90,\"(vide)\",\"\",ISBLANK(B90),\"\",B90)","v":0},0,0,null,null,"","","",""]
[null,null,null,null,null,"",{"$f":"_xlfn.SWITCH(B91,\"(vide)\",\"\",ISBLANK(B91),\"\",B91)","v":0},0,0,null,null,"","","",""]
[null,null,null,null,null,"",{"$f":"_xlfn.SWITCH(B92,\"(vide)\",\"\",ISBLANK(B92),\"\",B92)","v":0},0,0,null,null,"","","",""]
[null,null,null,null,null,"",{"$f":"_xlfn.SWITCH(B93,\"(vide)\",\"\",ISBLANK(B93),\"\",B93)","v":0},0,0,null,null,"","","",""]
[null,null,null,null,null,"",{"$f":"_xlfn.SWITCH(B94,\"(vide)\",\"\",ISBLANK(B94),\"\",B94)","v":0},0,0,null,null,"","","",""]
[null,null,null,null,null,"",{"$f":"_xlfn.SWITCH(B95,\"(vide)\",\"\",ISBLANK(B95),\"\",B95)","v":0},0,0,null,null,"","","",""]
[null,null,null,null,null,"",{"$f":"_xlfn.SWITCH(B96,\"(vide)\",\"\",ISBLANK(B96),\"\",B96)","v":0},0,0,null,null,"","","",""]
[null,null,null,null,null,"",{"$f":"_xlfn.SWITCH(B97,\"(vide)\",\"\",ISBLANK(B97),\"\",B97)","v":0},0,0,null,null,"","","",""]
[null,null,null,null,null,"",{"$f":"_xlfn.SWITCH(B98,\"(vide)\",\"\",ISBLANK(B98),\"\",B98)","v":0},0,0,null,null,"","","",""]
[null,null,null,null,null,"",{"$f":"_xlfn.SWITCH(B99,\"(vide)\",\"\",ISBLANK(B99),\"\",B99)","v":0},0,0,null,null,"","","",""]
[null,null,null,null,null,"",{"$f":"_xlfn.SWITCH(B100,\"(vide)\",\"\",ISBLANK(B100),\"\",B100)","v":0},0,0,null,null,"","","",""]
[null,null,null,null,null,"",{"$f":"_xlfn.SWITCH(B101,\"(vide)\",\"\",ISBLANK(B101),\"\",B101)","v":0},0,0,null,null,"","","",""]
[null,null,null,null,null,"",{"$f":"_xlfn.SWITCH(B102,\"(vide)\",\"\",ISBLANK(B102),\"\",B102)","v":0},0,0,null,null,"","","",""]
[null,null,null,null,null,"",{"$f":"_xlfn.SWITCH(B103,\"(vide)\",\"\",ISBLANK(B103),\"\",B103)","v":0},0,0,null,null,"","","",""]
[null,null,null,null,null,"",{"$f":"_xlfn.SWITCH(B104,\"(vide)\",\"\",ISBLANK(B104),\"\",B104)","v":0},0,0,null,null,"","","",""]
[null,null,null,null,null,"",{"$f":"_xlfn.SWITCH(B105,\"(vide)\",\"\",ISBLANK(B105),\"\",B105)","v":0},0,0,null,null,"","","",""]
[null,null,null,null,null,"",{"$f":"_xlfn.SWITCH(B106,\"(vide)\",\"\",ISBLANK(B106),\"\",B106)","v":0},0,0,null,null,"","","",""]
[null,null,null,null,null,"",{"$f":"_xlfn.SWITCH(B107,\"(vide)\",\"\",ISBLANK(B107),\"\",B107)","v":0},0,0,null,null,"","","",""]
[null,null,null,null,null,"",{"$f":"_xlfn.SWITCH(B108,\"(vide)\",\"\",ISBLANK(B108),\"\",B108)","v":0},0,0,null,null,"","","",""]
[null,null,null,null,null,"",{"$f":"_xlfn.SWITCH(B109,\"(vide)\",\"\",ISBLANK(B109),\"\",B109)","v":0},0,0,null,null,"","","",""]
[null,null,null,null,null,"",{"$f":"_xlfn.SWITCH(B110,\"(vide)\",\"\",ISBLANK(B110),\"\",B110)","v":0},0,0,null,null,"","","",""]
[null,null,null,null,null,"",{"$f":"_xlfn.SWITCH(B111,\"(vide)\",\"\",ISBLANK(B111),\"\",B111)","v":0},0,0,null,null,"","","",""]
[null,null,null,null,null,"",{"$f":"_xlfn.SWITCH(B112,\"(vide)\",\"\",ISBLANK(B112),\"\",B112)","v":0},0,0,null,null,"","","",""]
[null,null,null,null,null,"",{"$f":"_xlfn.SWITCH(B113,\"(vide)\",\"\",ISBLANK(B113),\"\",B113)","v":0},0,0,null,null,"","","",""]
[null,null,null,null,null,"",{"$f":"_xlfn.SWITCH(B114,\"(vide)\",\"\",ISBLANK(B114),\"\",B114)","v":0},0,0,null,null,"","","",""]
[null,null,null,null,null,"",{"$f":"_xlfn.SWITCH(B115,\"(vide)\",\"\",ISBLANK(B115),\"\",B115)","v":0},0,0,null,null,"","","",""]
[null,null,null,null,null,"",{"$f":"_xlfn.SWITCH(B116,\"(vide)\",\"\",ISBLANK(B116),\"\",B116)","v":0},0,0,null,null,"","","",""]
[null,null,null,null,null,"",{"$f":"_xlfn.SWITCH(B117,\"(vide)\",\"\",ISBLANK(B117),\"\",B117)","v":0},0,0,null,null,"","","",""]
[null,null,null,null,null,"",{"$f":"_xlfn.SWITCH(B118,\"(vide)\",\"\",ISBLANK(B118),\"\",B118)","v":0},0,0,null,null,"","","",""]
[null,null,null,null,null,"",{"$f":"_xlfn.SWITCH(B119,\"(vide)\",\"\",ISBLANK(B119),\"\",B119)","v":0},0,0,null,null,"","","",""]
[null,null,null,null,null,"",{"$f":"_xlfn.SWITCH(B120,\"(vide)\",\"\",ISBLANK(B120),\"\",B120)","v":0},0,0,null,null,"","","",""]
[null,null,null,null,null,"",{"$f":"_xlfn.SWITCH(B121,\"(vide)\",\"\",ISBLANK(B121),\"\",B121)","v":0},0,0,null,null,"","","",""]
[null,null,null,null,null,"",{"$f":"_xlfn.SWITCH(B122,\"(vide)\",\"\",ISBLANK(B122),\"\",B122)","v":0},0,0,null,null,"","","",""]
[null,null,null,null,null,"",{"$f":"_xlfn.SWITCH(B123,\"(vide)\",\"\",ISBLANK(B123),\"\",B123)","v":0},0,0,null,null,"","","",""]
[null,null,null,null,null,"",{"$f":"_xlfn.SWITCH(B124,\"(vide)\",\"\",ISBLANK(B124),\"\",B124)","v":0},0,0,null,null,"","","",""]
[null,null,null,null,null,"",{"$f":"_xlfn.SWITCH(B125,\"(vide)\",\"\",ISBLANK(B125),\"\",B125)","v":0},0,0,null,null,"","","",""]
[null,null,null,null,null,"",{"$f":"_xlfn.SWITCH(B126,\"(vide)\",\"\",ISBLANK(B126),\"\",B126)","v":0},0,0,null,null,"","","",""]
[null,null,null,null,null,"",{"$f":"_xlfn.SWITCH(B127,\"(vide)\",\"\",ISBLANK(B127),\"\",B127)","v":0},0,0,null,null,"","","",""]
[null,null,null,null,null,"",{"$f":"_xlfn.SWITCH(B128,\"(vide)\",\"\",ISBLANK(B128),\"\",B128)","v":0},0,0,null,null,"","","",""]
[null,null,null,null,null,"",{"$f":"_xlfn.SWITCH(B129,\"(vide)\",\"\",ISBLANK(B129),\"\",B129)","v":0},0,0,null,null,"","","",""]
[null,null,null,null,null,"",{"$f":"_xlfn.SWITCH(B130,\"(vide)\",\"\",ISBLANK(B130),\"\",B130)","v":0},0,0,null,null,"","","",""]
[null,null,null,null,null,{"$f":"IF(A131=\"\",\"\",A131)","v":""},{"$f":"_xlfn.SWITCH(B131,\"(vide)\",\"\",ISBLANK(B131),\"\",B131)","v":0},0,0,null,null,"","","",""]
[null,null,null,null,null,"",{"$f":"_xlfn.SWITCH(B132,\"(vide)\",\"\",ISBLANK(B132),\"\",B132)","v":0},0,0,null,null,{"$f":"IF(F132=0,\"\",F132)","v":""},"","",""]
[null,null,null,null,null,"",{"$f":"_xlfn.SWITCH(B133,\"(vide)\",\"\",ISBLANK(B133),\"\",B133)","v":0},0,0,null,null,"","","",""]
[null,null,null,null,null,"",{"$f":"_xlfn.SWITCH(B134,\"(vide)\",\"\",ISBLANK(B134),\"\",B134)","v":0},0,0,null,null,"","","",""]
[null,null,null,null,null,"",{"$f":"_xlfn.SWITCH(B135,\"(vide)\",\"\",ISBLANK(B135),\"\",B135)","v":0},0,0,null,null,"","","",""]
[null,null,null,null,null,"",{"$f":"_xlfn.SWITCH(B136,\"(vide)\",\"\",ISBLANK(B136),\"\",B136)","v":0},0,0,null,null,"","","",""]
[null,null,null,null,null,"",{"$f":"_xlfn.SWITCH(B137,\"(vide)\",\"\",ISBLANK(B137),\"\",B137)","v":0},0,0,null,null,"","","",""]
[null,null,null,null,null,"",{"$f":"_xlfn.SWITCH(B138,\"(vide)\",\"\",ISBLANK(B138),\"\",B138)","v":0},0,0,null,null,"","","",""]
[null,null,null,null,null,"",{"$f":"_xlfn.SWITCH(B139,\"(vide)\",\"\",ISBLANK(B139),\"\",B139)","v":0},0,0,null,null,"","","",""]
[null,null,null,null,null,"",{"$f":"_xlfn.SWITCH(B140,\"(vide)\",\"\",ISBLANK(B140),\"\",B140)","v":0},0,0,null,null,"","","",""]
[null,null,null,null,null,"",{"$f":"_xlfn.SWITCH(B141,\"(vide)\",\"\",ISBLANK(B141),\"\",B141)","v":0},0,0,null,null,"","","",""]
[null,null,null,null,null,"",{"$f":"_xlfn.SWITCH(B142,\"(vide)\",\"\",ISBLANK(B142),\"\",B142)","v":0},0,0,null,null,"","","",""]

{"sheet":"Bretagne","index":9,"n_rows":1,"n_cols":1,"rows_kept":1,"cut":false,"hidden":false,"merged":[[0,0,2,22]]}
["REGION\nBRETAGNE"]

{"sheet":"CVL TCD","index":10,"n_rows":142,"n_cols":15,"rows_kept":142,"cut":false,"hidden":true,"merged":[]}
["Pays","Provinces","Départements","CENTRE",null,{"$f":"A1","v":"Pays"},{"$f":"B1","v":"Provinces"},{"$f":"C1","v":"Départements"},"CENTRE",null,null,{"$f":"IF(F1=0,\"\",F1)","v":"Pays"},"Provinces","Départements","CENTRE"]
["France","Centre-Val de Loire","Cher","Bourges",null,{"$f":"IF(A2=\"\",\"\",A2)","v":"France"},{"$f":"IF(B2=\"(vide)\",\"\",B2)","v":"Centre-Val de Loire"},"Cher","Bourges",null,null,"France","Centre-Val de Loire","Cher","Bourges"]
["France","Centre-Val de Loire","Eure-et-Loir","Chartres",null,{"$f":"IF(A3=\"\",\"\",A3)","v":"France"},{"$f":"IF(B3=\"(vide)\",\"\",B3)","v":"Centre-Val de Loire"},"Eure-et-Loir","Chartres",null,null,{"$f":"IF(F3=0,\"\",F3)","v":"France"},{"$f":"IF(G3=0,\"\",G3)","v":"Centre-Val de Loire"},{"$f":"IF(H3=0,\"\",H3)","v":"Eure-et-Loir"},{"$f":"IF(I3=0,\"\",I3)","v":"Chartres"}]
["France","Centre-Val de Loire","Indre","Issoudun",null,"France","Centre-Val de Loire","Indre","Issoudun",null,null,{"$f":"IF(F4=0,\"\",F4)","v":"France"},"Centre-Val de Loire","Indre","Issoudun"]
["France","Centre-Val de Loire","Indre-et-Loire","Tours St Symphorien",null,"France",{"$f":"_xlfn.SWITCH(B5,\"(vide)\",\"\",ISBLANK(B5),\"\",B5)","v":"Centre-Val de Loire"},"Indre-et-Loire","Tours St Symphorien",null,null,"France","Centre-Val de Loire","Indre-et-Loire","Tours St Symphorien"]
["France","Centre-Val de Loire","Loiret","Montargis",null,"France",{"$f":"_xlfn.SWITCH(B6,\"(vide)\",\"\",ISBLANK(B6),\"\",B6)","v":"Centre-Val de Loire"},"Loiret","Montargis",null,null,"France","Centre-Val de Loire","Loiret","Montargis"]
["France","Centre-Val de Loire","Loiret","Orléans Olivet",null,"France",{"$f":"_xlfn.SWITCH(B7,\"(vide)\",\"\",ISBLANK(B7),\"\",B7)","v":"Centre-Val de Loire"},"Loiret","Orléans Olivet",null,null,"France","Centre-Val de Loire","Loiret","Orléans Olivet"]
["France","Centre-Val de Loire","Loir-et-Cher","Blois 2.0",null,"France",{"$f":"_xlfn.SWITCH(B8,\"(vide)\",\"\",ISBLANK(B8),\"\",B8)","v":"Centre-Val de Loire"},"Loir-et-Cher","Blois 2.0",null,null,"France","Centre-Val de Loire","Loir-et-Cher","Blois 2.0"]
[null,null,null,null,null,"",{"$f":"_xlfn.SWITCH(B9,\"(vide)\",\"\",ISBLANK(B9),\"\",B9)","v":0},0,0,null,null,"","","",""]
[null,null,null,null,null,"",{"$f":"_xlfn.SWITCH(B10,\"(vide)\",\"\",ISBLANK(B10),\"\",B10)","v":0},0,0,null,null,"","","",""]
[null,null,null,null,null,"",{"$f":"_xlfn.SWITCH(B11,\"(vide)\",\"\",ISBLANK(B11),\"\",B11)","v":0},0,0,null,null,"","","",""]
[null,null,null,null,null,"",{"$f":"_xlfn.SWITCH(B12,\"(vide)\",\"\",ISBLANK(B12),\"\",B12)","v":0},0,0,null,null,"","","",""]
[null,null,null,null,null,"",{"$f":"_xlfn.SWITCH(B13,\"(vide)\",\"\",ISBLANK(B13),\"\",B13)","v":0},0,0,null,null,"","","",""]
[null,null,null,null,null,"",{"$f":"_xlfn.SWITCH(B14,\"(vide)\",\"\",ISBLANK(B14),\"\",B14)","v":0},0,0,null,null,"","","",""]
[null,null,null,null,null,"",{"$f":"_xlfn.SWITCH(B15,\"(vide)\",\"\",ISBLANK(B15),\"\",B15)","v":0},0,0,null,null,"","","",""]
[null,null,null,null,null,"",{"$f":"_xlfn.SWITCH(B16,\"(vide)\",\"\",ISBLANK(B16),\"\",B16)","v":0},0,0,null,null,"","","",""]
[null,null,null,null,null,"",{"$f":"_xlfn.SWITCH(B17,\"(vide)\",\"\",ISBLANK(B17),\"\",B17)","v":0},{"$f":"C17","v":0},0,null,null,"","","",""]
[null,null,null,null,null,"",{"$f":"_xlfn.SWITCH(B18,\"(vide)\",\"\",ISBLANK(B18),\"\",B18)","v":0},0,0,null,null,"","","",""]
[null,null,null,null,null,"",{"$f":"_xlfn.SWITCH(B19,\"(vide)\",\"\",ISBLANK(B19),\"\",B19)","v":0},0,0,null,null,"","","",""]
[null,null,null,null,null,"",{"$f":"_xlfn.SWITCH(B20,\"(vide)\",\"\",ISBLANK(B20),\"\",B20)","v":0},0,0,null,null,"","","",""]
[null,null,null,null,null,"",{"$f":"_xlfn.SWITCH(B21,\"(vide)\",\"\",ISBLANK(B21),\"\",B21)","v":0},0,0,null,null,"","","",""]
[null,null,null,null,null,"",{"$f":"_xlfn.SWITCH(B22,\"(vide)\",\"\",ISBLANK(B22),\"\",B22)","v":0},0,0,null,null,"","","",""]
[null,null,null,null,null,"",{"$f":"_xlfn.SWITCH(B23,\"(vide)\",\"\",ISBLANK(B23),\"\",B23)","v":0},0,0,null,null,"","","",""]
[null,null,null,null,null,"",{"$f":"_xlfn.SWITCH(B24,\"(vide)\",\"\",ISBLANK(B24),\"\",B24)","v":0},0,0,null,null,"","","",""]
[null,null,null,null,null,"",{"$f":"_xlfn.SWITCH(B25,\"(vide)\",\"\",ISBLANK(B25),\"\",B25)","v":0},0,0,null,null,"","","",""]
[null,null,null,null,null,"",{"$f":"_xlfn.SWITCH(B26,\"(vide)\",\"\",ISBLANK(B26),\"\",B26)","v":0},0,0,null,null,"","","",""]
[null,null,null,null,null,"",{"$f":"_xlfn.SWITCH(B27,\"(vide)\",\"\",ISBLANK(B27),\"\",B27)","v":0},0,0,null,null,"","","",""]
[null,null,null,null,null,"",{"$f":"_xlfn.SWITCH(B28,\"(vide)\",\"\",ISBLANK(B28),\"\",B28)","v":0},0,0,null,null,"","","",""]
[null,null,null,null,null,"",{"$f":"_xlfn.SWITCH(B29,\"(vide)\",\"\",ISBLANK(B29),\"\",B29)","v":0},0,0,null,null,"","","",""]
[null,null,null,null,null,"",{"$f":"_xlfn.SWITCH(B30,\"(vide)\",\"\",ISBLANK(B30),\"\",B30)","v":0},0,0,null,null,"","","",""]
[null,null,null,null,null,"",{"$f":"_xlfn.SWITCH(B31,\"(vide)\",\"\",ISBLANK(B31),\"\",B31)","v":0},0,0,null,null,"","","",""]
[null,null,null,null,null,"",{"$f":"_xlfn.SWITCH(B32,\"(vide)\",\"\",ISBLANK(B32),\"\",B32)","v":0},0,0,null,null,"","","",""]
[null,null,null,null,null,"",{"$f":"_xlfn.SWITCH(B33,\"(vide)\",\"\",ISBLANK(B33),\"\",B33)","v":0},0,0,null,null,"","","",""]
[null,null,null,null,null,"",{"$f":"_xlfn.SWITCH(B34,\"(vide)\",\"\",ISBLANK(B34),\"\",B34)","v":0},0,0,null,null,"","","",""]
[null,null,null,null,null,"",{"$f":"_xlfn.SWITCH(B35,\"(vide)\",\"\",ISBLANK(B35),\"\",B35)","v":0},0,0,null,null,"","","",""]
[null,null,null,null,null,"",{"$f":"_xlfn.SWITCH(B36,\"(vide)\",\"\",ISBLANK(B36),\"\",B36)","v":0},0,0,null,null,"","","",""]
[null,null,null,null,null,"",{"$f":"_xlfn.SWITCH(B37,\"(vide)\",\"\",ISBLANK(B37),\"\",B37)","v":0},0,0,null,null,"","","",""]
[null,null,null,null,null,"",{"$f":"_xlfn.SWITCH(B38,\"(vide)\",\"\",ISBLANK(B38),\"\",B38)","v":0},0,0,null,null,"","","",""]
[null,null,null,null,null,"",{"$f":"_xlfn.SWITCH(B39,\"(vide)\",\"\",ISBLANK(B39),\"\",B39)","v":0},0,0,null,null,"","","",""]
[null,null,null,null,null,"",{"$f":"_xlfn.SWITCH(B40,\"(vide)\",\"\",ISBLANK(B40),\"\",B40)","v":0},0,0,null,null,"","","",""]
[null,null,null,null,null,"",{"$f":"_xlfn.SWITCH(B41,\"(vide)\",\"\",ISBLANK(B41),\"\",B41)","v":0},0,0,null,null,"","","",""]
[null,null,null,null,null,"",{"$f":"_xlfn.SWITCH(B42,\"(vide)\",\"\",ISBLANK(B42),\"\",B42)","v":0},0,0,null,null,"","","",""]
[null,null,null,null,null,"",{"$f":"_xlfn.SWITCH(B43,\"(vide)\",\"\",ISBLANK(B43),\"\",B43)","v":0},0,0,null,null,"","","",""]
[null,null,null,null,null,"",{"$f":"_xlfn.SWITCH(B44,\"(vide)\",\"\",ISBLANK(B44),\"\",B44)","v":0},0,0,null,null,"","","",""]
[null,null,null,null,null,"",{"$f":"_xlfn.SWITCH(B45,\"(vide)\",\"\",ISBLANK(B45),\"\",B45)","v":0},0,0,null,null,"","","",""]
[null,null,null,null,null,"",{"$f":"_xlfn.SWITCH(B46,\"(vide)\",\"\",ISBLANK(B46),\"\",B46)","v":0},0,0,null,null,"","","",""]
[null,null,null,null,null,"",{"$f":"_xlfn.SWITCH(B47,\"(vide)\",\"\",ISBLANK(B47),\"\",B47)","v":0},0,0,null,null,"","","",""]
[null,null,null,null,null,"",{"$f":"_xlfn.SWITCH(B48,\"(vide)\",\"\",ISBLANK(B48),\"\",B48)","v":0},0,0,null,null,"","","",""]
[null,null,null,null,null,"",{"$f":"_xlfn.SWITCH(B49,\"(vide)\",\"\",ISBLANK(B49),\"\",B49)","v":0},0,0,null,null,"","","",""]
[null,null,null,null,null,"",{"$f":"_xlfn.SWITCH(B50,\"(vide)\",\"\",ISBLANK(B50),\"\",B50)","v":0},0,0,null,null,"","","",""]
[null,null,null,null,null,"",{"$f":"_xlfn.SWITCH(B51,\"(vide)\",\"\",ISBLANK(B51),\"\",B51)","v":0},0,0,null,null,"","","",""]
[null,null,null,null,null,"",{"$f":"_xlfn.SWITCH(B52,\"(vide)\",\"\",ISBLANK(B52),\"\",B52)","v":0},0,0,null,null,"","","",""]
[null,null,null,null,null,"",{"$f":"_xlfn.SWITCH(B53,\"(vide)\",\"\",ISBLANK(B53),\"\",B53)","v":0},0,0,null,null,"","","",""]
[null,null,null,null,null,"",{"$f":"_xlfn.SWITCH(B54,\"(vide)\",\"\",ISBLANK(B54),\"\",B54)","v":0},0,0,null,null,"","","",""]
[null,null,null,null,null,"",{"$f":"_xlfn.SWITCH(B55,\"(vide)\",\"\",ISBLANK(B55),\"\",B55)","v":0},0,0,null,null,"","","",""]
[null,null,null,null,null,"",{"$f":"_xlfn.SWITCH(B56,\"(vide)\",\"\",ISBLANK(B56),\"\",B56)","v":0},0,0,null,null,"","","",""]
[null,null,null,null,null,"",{"$f":"_xlfn.SWITCH(B57,\"(vide)\",\"\",ISBLANK(B57),\"\",B57)","v":0},0,0,null,null,"","","",""]
[null,null,null,null,null,"",{"$f":"_xlfn.SWITCH(B58,\"(vide)\",\"\",ISBLANK(B58),\"\",B58)","v":0},0,0,null,null,"","","",""]
[null,null,null,null,null,"",{"$f":"_xlfn.SWITCH(B59,\"(vide)\",\"\",ISBLANK(B59),\"\",B59)","v":0},0,0,null,null,"","","",""]
[null,null,null,null,null,"",{"$f":"_xlfn.SWITCH(B60,\"(vide)\",\"\",ISBLANK(B60),\"\",B60)","v":0},0,0,null,null,"","","",""]
[null,null,null,null,null,"",{"$f":"_xlfn.SWITCH(B61,\"(vide)\",\"\",ISBLANK(B61),\"\",B61)","v":0},0,0,null,null,"","","",""]
[null,null,null,null,null,"",{"$f":"_xlfn.SWITCH(B62,\"(vide)\",\"\",ISBLANK(B62),\"\",B62)","v":0},0,0,null,null,"","","",""]
[null,null,null,null,null,"",{"$f":"_xlfn.SWITCH(B63,\"(vide)\",\"\",ISBLANK(B63),\"\",B63)","v":0},0,0,null,null,"","","",""]
[null,null,null,null,null,"",{"$f":"_xlfn.SWITCH(B64,\"(vide)\",\"\",ISBLANK(B64),\"\",B64)","v":0},0,0,null,null,"","","",""]
[null,null,null,null,null,"",{"$f":"_xlfn.SWITCH(B65,\"(vide)\",\"\",ISBLANK(B65),\"\",B65)","v":0},0,0,null,null,"","","",""]
[null,null,null,null,null,"",{"$f":"_xlfn.SWITCH(B66,\"(vide)\",\"\",ISBLANK(B66),\"\",B66)","v":0},0,0,null,null,"","","",""]
[null,null,null,null,null,{"$f":"IF(A67=\"\",\"\",A67)","v":""},{"$f":"_xlfn.SWITCH(B67,\"(vide)\",\"\",ISBLANK(B67),\"\",B67)","v":0},0,0,null,null,"","","",{"$f":"IF(I67=0,\"\",I67)","v":""}]
[null,null,null,null,null,"",{"$f":"_xlfn.SWITCH(B68,\"(vide)\",\"\",ISBLANK(B68),\"\",B68)","v":0},0,0,null,null,{"$f":"IF(F68=0,\"\",F68)","v":""},"","",""]
[null,null,null,null,null,"",{"$f":"_xlfn.SWITCH(B69,\"(vide)\",\"\",ISBLANK(B69),\"\",B69)","v":0},0,0,null,null,"","","",""]
[null,null,null,null,null,"",{"$f":"_xlfn.SWITCH(B70,\"(vide)\",\"\",ISBLANK(B70),\"\",B70)","v":0},0,0,null,null,"","","",""]
[null,null,null,null,null,"",{"$f":"_xlfn.SWITCH(B71,\"(vide)\",\"\",ISBLANK(B71),\"\",B71)","v":0},0,0,null,null,"","","",""]
[null,null,null,null,null,"",{"$f":"_xlfn.SWITCH(B72,\"(vide)\",\"\",ISBLANK(B72),\"\",B72)","v":0},0,0,null,null,"","","",""]
[null,null,null,null,null,"",{"$f":"_xlfn.SWITCH(B73,\"(vide)\",\"\",ISBLANK(B73),\"\",B73)","v":0},0,0,null,null,"","","",""]
[null,null,null,null,null,"",{"$f":"_xlfn.SWITCH(B74,\"(vide)\",\"\",ISBLANK(B74),\"\",B74)","v":0},0,0,null,null,"","","",""]
[null,null,null,null,null,"",{"$f":"_xlfn.SWITCH(B75,\"(vide)\",\"\",ISBLANK(B75),\"\",B75)","v":0},0,0,null,null,"","","",""]
[null,null,null,null,null,"",{"$f":"_xlfn.SWITCH(B76,\"(vide)\",\"\",ISBLANK(B76),\"\",B76)","v":0},0,0,null,null,"","","",""]
[null,null,null,null,null,"",{"$f":"_xlfn.SWITCH(B77,\"(vide)\",\"\",ISBLANK(B77),\"\",B77)","v":0},0,0,null,null,"","","",""]
[null,null,null,null,null,"",{"$f":"_xlfn.SWITCH(B78,\"(vide)\",\"\",ISBLANK(B78),\"\",B78)","v":0},0,0,null,null,"","","",""]
[null,null,null,null,null,"",{"$f":"_xlfn.SWITCH(B79,\"(vide)\",\"\",ISBLANK(B79),\"\",B79)","v":0},0,0,null,null,"","","",""]
[null,null,null,null,null,"",{"$f":"_xlfn.SWITCH(B80,\"(vide)\",\"\",ISBLANK(B80),\"\",B80)","v":0},0,0,null,null,"","","",""]
[null,null,null,null,null,"",{"$f":"_xlfn.SWITCH(B81,\"(vide)\",\"\",ISBLANK(B81),\"\",B81)","v":0},{"$f":"C81","v":0},0,null,null,"","","",""]
[null,null,null,null,null,"",{"$f":"_xlfn.SWITCH(B82,\"(vide)\",\"\",ISBLANK(B82),\"\",B82)","v":0},0,0,null,null,"","","",""]
[null,null,null,null,null,"",{"$f":"_xlfn.SWITCH(B83,\"(vide)\",\"\",ISBLANK(B83),\"\",B83)","v":0},0,0,null,null,"","","",""]
[null,null,null,null,null,"",{"$f":"_xlfn.SWITCH(B84,\"(vide)\",\"\",ISBLANK(B84),\"\",B84)","v":0},0,0,null,null,"","","",""]
[null,null,null,null,null,"",{"$f":"_xlfn.SWITCH(B85,\"(vide)\",\"\",ISBLANK(B85),\"\",B85)","v":0},0,0,null,null,"","","",""]
[null,null,null,null,null,"",{"$f":"_xlfn.SWITCH(B86,\"(vide)\",\"\",ISBLANK(B86),\"\",B86)","v":0},0,0,null,null,"","","",""]
[null,null,null,null,null,"",{"$f":"_xlfn.SWITCH(B87,\"(vide)\",\"\",ISBLANK(B87),\"\",B87)","v":0},0,0,null,null,"","","",""]
[null,null,null,null,null,"",{"$f":"_xlfn.SWITCH(B88,\"(vide)\",\"\",ISBLANK(B88),\"\",B88)","v":0},0,0,null,null,"","","",""]
[null,null,null,null,null,"",{"$f":"_xlfn.SWITCH(B89,\"(vide)\",\"\",ISBLANK(B89),\"\",B89)","v":0},0,0,null,null,"","","",""]
[null,null,null,null,null,"",{"$f":"_xlfn.SWITCH(B90,\"(vide)\",\"\",ISBLANK(B90),\"\",B90)","v":0},0,0,null,null,"","","",""]
[null,null,null,null,null,"",{"$f":"_xlfn.SWITCH(B91,\"(vide)\",\"\",ISBLANK(B91),\"\",B91)","v":0},0,0,null,null,"","","",""]
[null,null,null,null,null,"",{"$f":"_xlfn.SWITCH(B92,\"(vide)\",\"\",ISBLANK(B92),\"\",B92)","v":0},0,0,null,null,"","","",""]
[null,null,null,null,null,"",{"$f":"_xlfn.SWITCH(B93,\"(vide)\",\"\",ISBLANK(B93),\"\",B93)","v":0},0,0,null,null,"","","",""]
[null,null,null,null,null,"",{"$f":"_xlfn.SWITCH(B94,\"(vide)\",\"\",ISBLANK(B94),\"\",B94)","v":0},0,0,null,null,"","","",""]
[null,null,null,null,null,"",{"$f":"_xlfn.SWITCH(B95,\"(vide)\",\"\",ISBLANK(B95),\"\",B95)","v":0},0,0,null,null,"","","",""]
[null,null,null,null,null,"",{"$f":"_xlfn.SWITCH(B96,\"(vide)\",\"\",ISBLANK(B96),\"\",B96)","v":0},0,0,null,null,"","","",""]
[null,null,null,null,null,"",{"$f":"_xlfn.SWITCH(B97,\"(vide)\",\"\",ISBLANK(B97),\"\",B97)","v":0},0,0,null,null,"","","",""]
[null,null,null,null,null,"",{"$f":"_xlfn.SWITCH(B98,\"(vide)\",\"\",ISBLANK(B98),\"\",B98)","v":0},0,0,null,null,"","","",""]
[null,null,null,null,null,"",{"$f":"_xlfn.SWITCH(B99,\"(vide)\",\"\",ISBLANK(B99),\"\",B99)","v":0},0,0,null,null,"","","",""]
[null,null,null,null,null,"",{"$f":"_xlfn.SWITCH(B100,\"(vide)\",\"\",ISBLANK(B100),\"\",B100)","v":0},0,0,null,null,"","","",""]
[null,null,null,null,null,"",{"$f":"_xlfn.SWITCH(B101,\"(vide)\",\"\",ISBLANK(B101),\"\",B101)","v":0},0,0,null,null,"","","",""]
[null,null,null,null,null,"",{"$f":"_xlfn.SWITCH(B102,\"(vide)\",\"\",ISBLANK(B102),\"\",B102)","v":0},0,0,null,null,"","","",""]
[null,null,null,null,null,"",{"$f":"_xlfn.SWITCH(B103,\"(vide)\",\"\",ISBLANK(B103),\"\",B103)","v":0},0,0,null,null,"","","",""]
[null,null,null,null,null,"",{"$f":"_xlfn.SWITCH(B104,\"(vide)\",\"\",ISBLANK(B104),\"\",B104)","v":0},0,0,null,null,"","","",""]
[null,null,null,null,null,"",{"$f":"_xlfn.SWITCH(B105,\"(vide)\",\"\",ISBLANK(B105),\"\",B105)","v":0},0,0,null,null,"","","",""]
[null,null,null,null,null,"",{"$f":"_xlfn.SWITCH(B106,\"(vide)\",\"\",ISBLANK(B106),\"\",B106)","v":0},0,0,null,null,"","","",""]
[null,null,null,null,null,"",{"$f":"_xlfn.SWITCH(B107,\"(vide)\",\"\",ISBLANK(B107),\"\",B107)","v":0},0,0,null,null,"","","",""]
[null,null,null,null,null,"",{"$f":"_xlfn.SWITCH(B108,\"(vide)\",\"\",ISBLANK(B108),\"\",B108)","v":0},0,0,null,null,"","","",""]
[null,null,null,null,null,"",{"$f":"_xlfn.SWITCH(B109,\"(vide)\",\"\",ISBLANK(B109),\"\",B109)","v":0},0,0,null,null,"","","",""]
[null,null,null,null,null,"",{"$f":"_xlfn.SWITCH(B110,\"(vide)\",\"\",ISBLANK(B110),\"\",B110)","v":0},0,0,null,null,"","","",""]
[null,null,null,null,null,"",{"$f":"_xlfn.SWITCH(B111,\"(vide)\",\"\",ISBLANK(B111),\"\",B111)","v":0},0,0,null,null,"","","",""]
[null,null,null,null,null,"",{"$f":"_xlfn.SWITCH(B112,\"(vide)\",\"\",ISBLANK(B112),\"\",B112)","v":0},0,0,null,null,"","","",""]
[null,null,null,null,null,"",{"$f":"_xlfn.SWITCH(B113,\"(vide)\",\"\",ISBLANK(B113),\"\",B113)","v":0},0,0,null,null,"","","",""]
[null,null,null,null,null,"",{"$f":"_xlfn.SWITCH(B114,\"(vide)\",\"\",ISBLANK(B114),\"\",B114)","v":0},0,0,null,null,"","","",""]
[null,null,null,null,null,"",{"$f":"_xlfn.SWITCH(B115,\"(vide)\",\"\",ISBLANK(B115),\"\",B115)","v":0},0,0,null,null,"","","",""]
[null,null,null,null,null,"",{"$f":"_xlfn.SWITCH(B116,\"(vide)\",\"\",ISBLANK(B116),\"\",B116)","v":0},0,0,null,null,"","","",""]
[null,null,null,null,null,"",{"$f":"_xlfn.SWITCH(B117,\"(vide)\",\"\",ISBLANK(B117),\"\",B117)","v":0},0,0,null,null,"","","",""]
[null,null,null,null,null,"",{"$f":"_xlfn.SWITCH(B118,\"(vide)\",\"\",ISBLANK(B118),\"\",B118)","v":0},0,0,null,null,"","","",""]
[null,null,null,null,null,"",{"$f":"_xlfn.SWITCH(B119,\"(vide)\",\"\",ISBLANK(B119),\"\",B119)","v":0},0,0,null,null,"","","",""]
[null,null,null,null,null,"",{"$f":"_xlfn.SWITCH(B120,\"(vide)\",\"\",ISBLANK(B120),\"\",B120)","v":0},0,0,null,null,"","","",""]
[null,null,null,null,null,"",{"$f":"_xlfn.SWITCH(B121,\"(vide)\",\"\",ISBLANK(B121),\"\",B121)","v":0},0,0,null,null,"","","",""]
[null,null,null,null,null,"",{"$f":"_xlfn.SWITCH(B122,\"(vide)\",\"\",ISBLANK(B122),\"\",B122)","v":0},0,0,null,null,"","","",""]
[null,null,null,null,null,"",{"$f":"_xlfn.SWITCH(B123,\"(vide)\",\"\",ISBLANK(B123),\"\",B123)","v":0},0,0,null,null,"","","",""]
[null,null,null,null,null,"",{"$f":"_xlfn.SWITCH(B124,\"(vide)\",\"\",ISBLANK(B124),\"\",B124)","v":0},0,0,null,null,"","","",""]
[null,null,null,null,null,"",{"$f":"_xlfn.SWITCH(B125,\"(vide)\",\"\",ISBLANK(B125),\"\",B125)","v":0},0,0,null,null,"","","",""]
[null,null,null,null,null,"",{"$f":"_xlfn.SWITCH(B126,\"(vide)\",\"\",ISBLANK(B126),\"\",B126)","v":0},0,0,null,null,"","","",""]
[null,null,null,null,null,"",{"$f":"_xlfn.SWITCH(B127,\"(vide)\",\"\",ISBLANK(B127),\"\",B127)","v":0},0,0,null,null,"","","",""]
[null,null,null,null,null,"",{"$f":"_xlfn.SWITCH(B128,\"(vide)\",\"\",ISBLANK(B128),\"\",B128)","v":0},0,0,null,null,"","","",""]
[null,null,null,null,null,"",{"$f":"_xlfn.SWITCH(B129,\"(vide)\",\"\",ISBLANK(B129),\"\",B129)","v":0},0,0,null,null,"","","",""]
[null,null,null,null,null,"",{"$f":"_xlfn.SWITCH(B130,\"(vide)\",\"\",ISBLANK(B130),\"\",B130)","v":0},0,0,null,null,"","","",""]
[null,null,null,null,null,{"$f":"IF(A131=\"\",\"\",A131)","v":""},{"$f":"_xlfn.SWITCH(B131,\"(vide)\",\"\",ISBLANK(B131),\"\",B131)","v":0},0,0,null,null,"","","",""]
[null,null,null,null,null,"",{"$f":"_xlfn.SWITCH(B132,\"(vide)\",\"\",ISBLANK(B132),\"\",B132)","v":0},0,0,null,null,{"$f":"IF(F132=0,\"\",F132)","v":""},"","",""]
[null,null,null,null,null,"",{"$f":"_xlfn.SWITCH(B133,\"(vide)\",\"\",ISBLANK(B133),\"\",B133)","v":0},0,0,null,null,"","","",""]
[null,null,null,null,null,"",{"$f":"_xlfn.SWITCH(B134,\"(vide)\",\"\",ISBLANK(B134),\"\",B134)","v":0},0,0,null,null,"","","",""]
[null,null,null,null,null,"",{"$f":"_xlfn.SWITCH(B135,\"(vide)\",\"\",ISBLANK(B135),\"\",B135)","v":0},0,0,null,null,"","","",""]
[null,null,null,null,null,"",{"$f":"_xlfn.SWITCH(B136,\"(vide)\",\"\",ISBLANK(B136),\"\",B136)","v":0},0,0,null,null,"","","",""]
[null,null,null,null,null,"",{"$f":"_xlfn.SWITCH(B137,\"(vide)\",\"\",ISBLANK(B137),\"\",B137)","v":0},0,0,null,null,"","","",""]
[null,null,null,null,null,"",{"$f":"_xlfn.SWITCH(B138,\"(vide)\",\"\",ISBLANK(B138),\"\",B138)","v":0},0,0,null,null,"","","",""]
[null,null,null,null,null,"",{"$f":"_xlfn.SWITCH(B139,\"(vide)\",\"\",ISBLANK(B139),\"\",B139)","v":0},0,0,null,null,"","","",""]
[null,null,null,null,null,"",{"$f":"_xlfn.SWITCH(B140,\"(vide)\",\"\",ISBLANK(B140),\"\",B140)","v":0},0,0,null,null,"","","",""]
[null,null,null,null,null,"",{"$f":"_xlfn.SWITCH(B141,\"(vide)\",\"\",ISBLANK(B141),\"\",B141)","v":0},0,0,null,null,"","","",""]
[null,null,null,null,null,"",{"$f":"_xlfn.SWITCH(B142,\"(vide)\",\"\",ISBLANK(B142),\"\",B142)","v":0},0,0,null,null,"","","",""]

{"sheet":"CVL","index":11,"n_rows":1,"n_cols":1,"rows_kept":1,"cut":false,"hidden":false,"merged":[[0,0,2,22]]}
["REGION\nCENTRE VAL DE LOIRE"]

{"sheet":"Corse TCD","index":12,"n_rows":142,"n_cols":15,"rows_kept":142,"cut":false,"hidden":true,"merged":[]}
["Pays","Provinces","Départements","CENTRE",null,{"$f":"A1","v":"Pays"},{"$f":"B1","v":"Provinces"},{"$f":"C1","v":"Départements"},"CENTRE",null,null,{"$f":"IF(F1=0,\"\",F1)","v":"Pays"},"Provinces","Départements","CENTRE"]
["France","Corse","Corse-du-Sud","Ajaccio Yolanda",null,{"$f":"IF(A2=\"\",\"\",A2)","v":"France"},{"$f":"IF(B2=\"(vide)\",\"\",B2)","v":"Corse"},"Corse-du-Sud","Ajaccio Yolanda",null,null,"France","Corse","Corse-du-Sud","Ajaccio Yolanda"]
["France","Corse","Haute-Corse","Bastia Borgo",null,{"$f":"IF(A3=\"\",\"\",A3)","v":"France"},{"$f":"IF(B3=\"(vide)\",\"\",B3)","v":"Corse"},"Haute-Corse","Bastia Borgo",null,null,{"$f":"IF(F3=0,\"\",F3)","v":"France"},{"$f":"IF(G3=0,\"\",G3)","v":"Corse"},{"$f":"IF(H3=0,\"\",H3)","v":"Haute-Corse"},{"$f":"IF(I3=0,\"\",I3)","v":"Bastia Borgo"}]
["France","Corse","Haute-Corse","Corte",null,"France","Corse","Haute-Corse","Corte",null,null,{"$f":"IF(F4=0,\"\",F4)","v":"France"},"Corse","Haute-Corse","Corte"]
[null,null,null,null,null,"",{"$f":"_xlfn.SWITCH(B5,\"(vide)\",\"\",ISBLANK(B5),\"\",B5)","v":0},0,0,null,null,"","","",""]
[null,null,null,null,null,"",{"$f":"_xlfn.SWITCH(B6,\"(vide)\",\"\",ISBLANK(B6),\"\",B6)","v":0},0,0,null,null,"","","",""]
[null,null,null,null,null,"",{"$f":"_xlfn.SWITCH(B7,\"(vide)\",\"\",ISBLANK(B7),\"\",B7)","v":0},0,0,null,null,"","","",""]
[null,null,null,null,null,"",{"$f":"_xlfn.SWITCH(B8,\"(vide)\",\"\",ISBLANK(B8),\"\",B8)","v":0},0,0,null,null,"","","",""]
[null,null,null,null,null,"",{"$f":"_xlfn.SWITCH(B9,\"(vide)\",\"\",ISBLANK(B9),\"\",B9)","v":0},0,0,null,null,"","","",""]
[null,null,null,null,null,"",{"$f":"_xlfn.SWITCH(B10,\"(vide)\",\"\",ISBLANK(B10),\"\",B10)","v":0},0,0,null,null,"","","",""]
[null,null,null,null,null,"",{"$f":"_xlfn.SWITCH(B11,\"(vide)\",\"\",ISBLANK(B11),\"\",B11)","v":0},0,0,null,null,"","","",""]
[null,null,null,null,null,"",{"$f":"_xlfn.SWITCH(B12,\"(vide)\",\"\",ISBLANK(B12),\"\",B12)","v":0},0,0,null,null,"","","",""]
[null,null,null,null,null,"",{"$f":"_xlfn.SWITCH(B13,\"(vide)\",\"\",ISBLANK(B13),\"\",B13)","v":0},0,0,null,null,"","","",""]
[null,null,null,null,null,"",{"$f":"_xlfn.SWITCH(B14,\"(vide)\",\"\",ISBLANK(B14),\"\",B14)","v":0},0,0,null,null,"","","",""]
[null,null,null,null,null,"",{"$f":"_xlfn.SWITCH(B15,\"(vide)\",\"\",ISBLANK(B15),\"\",B15)","v":0},0,0,null,null,"","","",""]
[null,null,null,null,null,"",{"$f":"_xlfn.SWITCH(B16,\"(vide)\",\"\",ISBLANK(B16),\"\",B16)","v":0},0,0,null,null,"","","",""]
[null,null,null,null,null,"",{"$f":"_xlfn.SWITCH(B17,\"(vide)\",\"\",ISBLANK(B17),\"\",B17)","v":0},{"$f":"C17","v":0},0,null,null,"","","",""]
[null,null,null,null,null,"",{"$f":"_xlfn.SWITCH(B18,\"(vide)\",\"\",ISBLANK(B18),\"\",B18)","v":0},0,0,null,null,"","","",""]
[null,null,null,null,null,"",{"$f":"_xlfn.SWITCH(B19,\"(vide)\",\"\",ISBLANK(B19),\"\",B19)","v":0},0,0,null,null,"","","",""]
[null,null,null,null,null,"",{"$f":"_xlfn.SWITCH(B20,\"(vide)\",\"\",ISBLANK(B20),\"\",B20)","v":0},0,0,null,null,"","","",""]
[null,null,null,null,null,"",{"$f":"_xlfn.SWITCH(B21,\"(vide)\",\"\",ISBLANK(B21),\"\",B21)","v":0},0,0,null,null,"","","",""]
[null,null,null,null,null,"",{"$f":"_xlfn.SWITCH(B22,\"(vide)\",\"\",ISBLANK(B22),\"\",B22)","v":0},0,0,null,null,"","","",""]
[null,null,null,null,null,"",{"$f":"_xlfn.SWITCH(B23,\"(vide)\",\"\",ISBLANK(B23),\"\",B23)","v":0},0,0,null,null,"","","",""]
[null,null,null,null,null,"",{"$f":"_xlfn.SWITCH(B24,\"(vide)\",\"\",ISBLANK(B24),\"\",B24)","v":0},0,0,null,null,"","","",""]
[null,null,null,null,null,"",{"$f":"_xlfn.SWITCH(B25,\"(vide)\",\"\",ISBLANK(B25),\"\",B25)","v":0},0,0,null,null,"","","",""]
[null,null,null,null,null,"",{"$f":"_xlfn.SWITCH(B26,\"(vide)\",\"\",ISBLANK(B26),\"\",B26)","v":0},0,0,null,null,"","","",""]
[null,null,null,null,null,"",{"$f":"_xlfn.SWITCH(B27,\"(vide)\",\"\",ISBLANK(B27),\"\",B27)","v":0},0,0,null,null,"","","",""]
[null,null,null,null,null,"",{"$f":"_xlfn.SWITCH(B28,\"(vide)\",\"\",ISBLANK(B28),\"\",B28)","v":0},0,0,null,null,"","","",""]
[null,null,null,null,null,"",{"$f":"_xlfn.SWITCH(B29,\"(vide)\",\"\",ISBLANK(B29),\"\",B29)","v":0},0,0,null,null,"","","",""]
[null,null,null,null,null,"",{"$f":"_xlfn.SWITCH(B30,\"(vide)\",\"\",ISBLANK(B30),\"\",B30)","v":0},0,0,null,null,"","","",""]
[null,null,null,null,null,"",{"$f":"_xlfn.SWITCH(B31,\"(vide)\",\"\",ISBLANK(B31),\"\",B31)","v":0},0,0,null,null,"","","",""]
[null,null,null,null,null,"",{"$f":"_xlfn.SWITCH(B32,\"(vide)\",\"\",ISBLANK(B32),\"\",B32)","v":0},0,0,null,null,"","","",""]
[null,null,null,null,null,"",{"$f":"_xlfn.SWITCH(B33,\"(vide)\",\"\",ISBLANK(B33),\"\",B33)","v":0},0,0,null,null,"","","",""]
[null,null,null,null,null,"",{"$f":"_xlfn.SWITCH(B34,\"(vide)\",\"\",ISBLANK(B34),\"\",B34)","v":0},0,0,null,null,"","","",""]
[null,null,null,null,null,"",{"$f":"_xlfn.SWITCH(B35,\"(vide)\",\"\",ISBLANK(B35),\"\",B35)","v":0},0,0,null,null,"","","",""]
[null,null,null,null,null,"",{"$f":"_xlfn.SWITCH(B36,\"(vide)\",\"\",ISBLANK(B36),\"\",B36)","v":0},0,0,null,null,"","","",""]
[null,null,null,null,null,"",{"$f":"_xlfn.SWITCH(B37,\"(vide)\",\"\",ISBLANK(B37),\"\",B37)","v":0},0,0,null,null,"","","",""]
[null,null,null,null,null,"",{"$f":"_xlfn.SWITCH(B38,\"(vide)\",\"\",ISBLANK(B38),\"\",B38)","v":0},0,0,null,null,"","","",""]
[null,null,null,null,null,"",{"$f":"_xlfn.SWITCH(B39,\"(vide)\",\"\",ISBLANK(B39),\"\",B39)","v":0},0,0,null,null,"","","",""]
[null,null,null,null,null,"",{"$f":"_xlfn.SWITCH(B40,\"(vide)\",\"\",ISBLANK(B40),\"\",B40)","v":0},0,0,null,null,"","","",""]
[null,null,null,null,null,"",{"$f":"_xlfn.SWITCH(B41,\"(vide)\",\"\",ISBLANK(B41),\"\",B41)","v":0},0,0,null,null,"","","",""]
[null,null,null,null,null,"",{"$f":"_xlfn.SWITCH(B42,\"(vide)\",\"\",ISBLANK(B42),\"\",B42)","v":0},0,0,null,null,"","","",""]
[null,null,null,null,null,"",{"$f":"_xlfn.SWITCH(B43,\"(vide)\",\"\",ISBLANK(B43),\"\",B43)","v":0},0,0,null,null,"","","",""]
[null,null,null,null,null,"",{"$f":"_xlfn.SWITCH(B44,\"(vide)\",\"\",ISBLANK(B44),\"\",B44)","v":0},0,0,null,null,"","","",""]
[null,null,null,null,null,"",{"$f":"_xlfn.SWITCH(B45,\"(vide)\",\"\",ISBLANK(B45),\"\",B45)","v":0},0,0,null,null,"","","",""]
[null,null,null,null,null,"",{"$f":"_xlfn.SWITCH(B46,\"(vide)\",\"\",ISBLANK(B46),\"\",B46)","v":0},0,0,null,null,"","","",""]
[null,null,null,null,null,"",{"$f":"_xlfn.SWITCH(B47,\"(vide)\",\"\",ISBLANK(B47),\"\",B47)","v":0},0,0,null,null,"","","",""]
[null,null,null,null,null,"",{"$f":"_xlfn.SWITCH(B48,\"(vide)\",\"\",ISBLANK(B48),\"\",B48)","v":0},0,0,null,null,"","","",""]
[null,null,null,null,null,"",{"$f":"_xlfn.SWITCH(B49,\"(vide)\",\"\",ISBLANK(B49),\"\",B49)","v":0},0,0,null,null,"","","",""]
[null,null,null,null,null,"",{"$f":"_xlfn.SWITCH(B50,\"(vide)\",\"\",ISBLANK(B50),\"\",B50)","v":0},0,0,null,null,"","","",""]
[null,null,null,null,null,"",{"$f":"_xlfn.SWITCH(B51,\"(vide)\",\"\",ISBLANK(B51),\"\",B51)","v":0},0,0,null,null,"","","",""]
[null,null,null,null,null,"",{"$f":"_xlfn.SWITCH(B52,\"(vide)\",\"\",ISBLANK(B52),\"\",B52)","v":0},0,0,null,null,"","","",""]
[null,null,null,null,null,"",{"$f":"_xlfn.SWITCH(B53,\"(vide)\",\"\",ISBLANK(B53),\"\",B53)","v":0},0,0,null,null,"","","",""]
[null,null,null,null,null,"",{"$f":"_xlfn.SWITCH(B54,\"(vide)\",\"\",ISBLANK(B54),\"\",B54)","v":0},0,0,null,null,"","","",""]
[null,null,null,null,null,"",{"$f":"_xlfn.SWITCH(B55,\"(vide)\",\"\",ISBLANK(B55),\"\",B55)","v":0},0,0,null,null,"","","",""]
[null,null,null,null,null,"",{"$f":"_xlfn.SWITCH(B56,\"(vide)\",\"\",ISBLANK(B56),\"\",B56)","v":0},0,0,null,null,"","","",""]
[null,null,null,null,null,"",{"$f":"_xlfn.SWITCH(B57,\"(vide)\",\"\",ISBLANK(B57),\"\",B57)","v":0},0,0,null,null,"","","",""]
[null,null,null,null,null,"",{"$f":"_xlfn.SWITCH(B58,\"(vide)\",\"\",ISBLANK(B58),\"\",B58)","v":0},0,0,null,null,"","","",""]
[null,null,null,null,null,"",{"$f":"_xlfn.SWITCH(B59,\"(vide)\",\"\",ISBLANK(B59),\"\",B59)","v":0},0,0,null,null,"","","",""]
[null,null,null,null,null,"",{"$f":"_xlfn.SWITCH(B60,\"(vide)\",\"\",ISBLANK(B60),\"\",B60)","v":0},0,0,null,null,"","","",""]
[null,null,null,null,null,"",{"$f":"_xlfn.SWITCH(B61,\"(vide)\",\"\",ISBLANK(B61),\"\",B61)","v":0},0,0,null,null,"","","",""]
[null,null,null,null,null,"",{"$f":"_xlfn.SWITCH(B62,\"(vide)\",\"\",ISBLANK(B62),\"\",B62)","v":0},0,0,null,null,"","","",""]
[null,null,null,null,null,"",{"$f":"_xlfn.SWITCH(B63,\"(vide)\",\"\",ISBLANK(B63),\"\",B63)","v":0},0,0,null,null,"","","",""]
[null,null,null,null,null,"",{"$f":"_xlfn.SWITCH(B64,\"(vide)\",\"\",ISBLANK(B64),\"\",B64)","v":0},0,0,null,null,"","","",""]
[null,null,null,null,null,"",{"$f":"_xlfn.SWITCH(B65,\"(vide)\",\"\",ISBLANK(B65),\"\",B65)","v":0},0,0,null,null,"","","",""]
[null,null,null,null,null,"",{"$f":"_xlfn.SWITCH(B66,\"(vide)\",\"\",ISBLANK(B66),\"\",B66)","v":0},0,0,null,null,"","","",""]
[null,null,null,null,null,{"$f":"IF(A67=\"\",\"\",A67)","v":""},{"$f":"_xlfn.SWITCH(B67,\"(vide)\",\"\",ISBLANK(B67),\"\",B67)","v":0},0,0,null,null,"","","",{"$f":"IF(I67=0,\"\",I67)","v":""}]
[null,null,null,null,null,"",{"$f":"_xlfn.SWITCH(B68,\"(vide)\",\"\",ISBLANK(B68),\"\",B68)","v":0},0,0,null,null,{"$f":"IF(F68=0,\"\",F68)","v":""},"","",""]
[null,null,null,null,null,"",{"$f":"_xlfn.SWITCH(B69,\"(vide)\",\"\",ISBLANK(B69),\"\",B69)","v":0},0,0,null,null,"","","",""]
[null,null,null,null,null,"",{"$f":"_xlfn.SWITCH(B70,\"(vide)\",\"\",ISBLANK(B70),\"\",B70)","v":0},0,0,null,null,"","","",""]
[null,null,null,null,null,"",{"$f":"_xlfn.SWITCH(B71,\"(vide)\",\"\",ISBLANK(B71),\"\",B71)","v":0},0,0,null,null,"","","",""]
[null,null,null,null,null,"",{"$f":"_xlfn.SWITCH(B72,\"(vide)\",\"\",ISBLANK(B72),\"\",B72)","v":0},0,0,null,null,"","","",""]
[null,null,null,null,null,"",{"$f":"_xlfn.SWITCH(B73,\"(vide)\",\"\",ISBLANK(B73),\"\",B73)","v":0},0,0,null,null,"","","",""]
[null,null,null,null,null,"",{"$f":"_xlfn.SWITCH(B74,\"(vide)\",\"\",ISBLANK(B74),\"\",B74)","v":0},0,0,null,null,"","","",""]
[null,null,null,null,null,"",{"$f":"_xlfn.SWITCH(B75,\"(vide)\",\"\",ISBLANK(B75),\"\",B75)","v":0},0,0,null,null,"","","",""]
[null,null,null,null,null,"",{"$f":"_xlfn.SWITCH(B76,\"(vide)\",\"\",ISBLANK(B76),\"\",B76)","v":0},0,0,null,null,"","","",""]
[null,null,null,null,null,"",{"$f":"_xlfn.SWITCH(B77,\"(vide)\",\"\",ISBLANK(B77),\"\",B77)","v":0},0,0,null,null,"","","",""]
[null,null,null,null,null,"",{"$f":"_xlfn.SWITCH(B78,\"(vide)\",\"\",ISBLANK(B78),\"\",B78)","v":0},0,0,null,null,"","","",""]
[null,null,null,null,null,"",{"$f":"_xlfn.SWITCH(B79,\"(vide)\",\"\",ISBLANK(B79),\"\",B79)","v":0},0,0,null,null,"","","",""]
[null,null,null,null,null,"",{"$f":"_xlfn.SWITCH(B80,\"(vide)\",\"\",ISBLANK(B80),\"\",B80)","v":0},0,0,null,null,"","","",""]
[null,null,null,null,null,"",{"$f":"_xlfn.SWITCH(B81,\"(vide)\",\"\",ISBLANK(B81),\"\",B81)","v":0},{"$f":"C81","v":0},0,null,null,"","","",""]
[null,null,null,null,null,"",{"$f":"_xlfn.SWITCH(B82,\"(vide)\",\"\",ISBLANK(B82),\"\",B82)","v":0},0,0,null,null,"","","",""]
[null,null,null,null,null,"",{"$f":"_xlfn.SWITCH(B83,\"(vide)\",\"\",ISBLANK(B83),\"\",B83)","v":0},0,0,null,null,"","","",""]
[null,null,null,null,null,"",{"$f":"_xlfn.SWITCH(B84,\"(vide)\",\"\",ISBLANK(B84),\"\",B84)","v":0},0,0,null,null,"","","",""]
[null,null,null,null,null,"",{"$f":"_xlfn.SWITCH(B85,\"(vide)\",\"\",ISBLANK(B85),\"\",B85)","v":0},0,0,null,null,"","","",""]
[null,null,null,null,null,"",{"$f":"_xlfn.SWITCH(B86,\"(vide)\",\"\",ISBLANK(B86),\"\",B86)","v":0},0,0,null,null,"","","",""]
[null,null,null,null,null,"",{"$f":"_xlfn.SWITCH(B87,\"(vide)\",\"\",ISBLANK(B87),\"\",B87)","v":0},0,0,null,null,"","","",""]
[null,null,null,null,null,"",{"$f":"_xlfn.SWITCH(B88,\"(vide)\",\"\",ISBLANK(B88),\"\",B88)","v":0},0,0,null,null,"","","",""]
[null,null,null,null,null,"",{"$f":"_xlfn.SWITCH(B89,\"(vide)\",\"\",ISBLANK(B89),\"\",B89)","v":0},0,0,null,null,"","","",""]
[null,null,null,null,null,"",{"$f":"_xlfn.SWITCH(B90,\"(vide)\",\"\",ISBLANK(B90),\"\",B90)","v":0},0,0,null,null,"","","",""]
[null,null,null,null,null,"",{"$f":"_xlfn.SWITCH(B91,\"(vide)\",\"\",ISBLANK(B91),\"\",B91)","v":0},0,0,null,null,"","","",""]
[null,null,null,null,null,"",{"$f":"_xlfn.SWITCH(B92,\"(vide)\",\"\",ISBLANK(B92),\"\",B92)","v":0},0,0,null,null,"","","",""]
[null,null,null,null,null,"",{"$f":"_xlfn.SWITCH(B93,\"(vide)\",\"\",ISBLANK(B93),\"\",B93)","v":0},0,0,null,null,"","","",""]
[null,null,null,null,null,"",{"$f":"_xlfn.SWITCH(B94,\"(vide)\",\"\",ISBLANK(B94),\"\",B94)","v":0},0,0,null,null,"","","",""]
[null,null,null,null,null,"",{"$f":"_xlfn.SWITCH(B95,\"(vide)\",\"\",ISBLANK(B95),\"\",B95)","v":0},0,0,null,null,"","","",""]
[null,null,null,null,null,"",{"$f":"_xlfn.SWITCH(B96,\"(vide)\",\"\",ISBLANK(B96),\"\",B96)","v":0},0,0,null,null,"","","",""]
[null,null,null,null,null,"",{"$f":"_xlfn.SWITCH(B97,\"(vide)\",\"\",ISBLANK(B97),\"\",B97)","v":0},0,0,null,null,"","","",""]
[null,null,null,null,null,"",{"$f":"_xlfn.SWITCH(B98,\"(vide)\",\"\",ISBLANK(B98),\"\",B98)","v":0},0,0,null,null,"","","",""]
[null,null,null,null,null,"",{"$f":"_xlfn.SWITCH(B99,\"(vide)\",\"\",ISBLANK(B99),\"\",B99)","v":0},0,0,null,null,"","","",""]
[null,null,null,null,null,"",{"$f":"_xlfn.SWITCH(B100,\"(vide)\",\"\",ISBLANK(B100),\"\",B100)","v":0},0,0,null,null,"","","",""]
[null,null,null,null,null,"",{"$f":"_xlfn.SWITCH(B101,\"(vide)\",\"\",ISBLANK(B101),\"\",B101)","v":0},0,0,null,null,"","","",""]
[null,null,null,null,null,"",{"$f":"_xlfn.SWITCH(B102,\"(vide)\",\"\",ISBLANK(B102),\"\",B102)","v":0},0,0,null,null,"","","",""]
[null,null,null,null,null,"",{"$f":"_xlfn.SWITCH(B103,\"(vide)\",\"\",ISBLANK(B103),\"\",B103)","v":0},0,0,null,null,"","","",""]
[null,null,null,null,null,"",{"$f":"_xlfn.SWITCH(B104,\"(vide)\",\"\",ISBLANK(B104),\"\",B104)","v":0},0,0,null,null,"","","",""]
[null,null,null,null,null,"",{"$f":"_xlfn.SWITCH(B105,\"(vide)\",\"\",ISBLANK(B105),\"\",B105)","v":0},0,0,null,null,"","","",""]
[null,null,null,null,null,"",{"$f":"_xlfn.SWITCH(B106,\"(vide)\",\"\",ISBLANK(B106),\"\",B106)","v":0},0,0,null,null,"","","",""]
[null,null,null,null,null,"",{"$f":"_xlfn.SWITCH(B107,\"(vide)\",\"\",ISBLANK(B107),\"\",B107)","v":0},0,0,null,null,"","","",""]
[null,null,null,null,null,"",{"$f":"_xlfn.SWITCH(B108,\"(vide)\",\"\",ISBLANK(B108),\"\",B108)","v":0},0,0,null,null,"","","",""]
[null,null,null,null,null,"",{"$f":"_xlfn.SWITCH(B109,\"(vide)\",\"\",ISBLANK(B109),\"\",B109)","v":0},0,0,null,null,"","","",""]
[null,null,null,null,null,"",{"$f":"_xlfn.SWITCH(B110,\"(vide)\",\"\",ISBLANK(B110),\"\",B110)","v":0},0,0,null,null,"","","",""]
[null,null,null,null,null,"",{"$f":"_xlfn.SWITCH(B111,\"(vide)\",\"\",ISBLANK(B111),\"\",B111)","v":0},0,0,null,null,"","","",""]
[null,null,null,null,null,"",{"$f":"_xlfn.SWITCH(B112,\"(vide)\",\"\",ISBLANK(B112),\"\",B112)","v":0},0,0,null,null,"","","",""]
[null,null,null,null,null,"",{"$f":"_xlfn.SWITCH(B113,\"(vide)\",\"\",ISBLANK(B113),\"\",B113)","v":0},0,0,null,null,"","","",""]
[null,null,null,null,null,"",{"$f":"_xlfn.SWITCH(B114,\"(vide)\",\"\",ISBLANK(B114),\"\",B114)","v":0},0,0,null,null,"","","",""]
[null,null,null,null,null,"",{"$f":"_xlfn.SWITCH(B115,\"(vide)\",\"\",ISBLANK(B115),\"\",B115)","v":0},0,0,null,null,"","","",""]
[null,null,null,null,null,"",{"$f":"_xlfn.SWITCH(B116,\"(vide)\",\"\",ISBLANK(B116),\"\",B116)","v":0},0,0,null,null,"","","",""]
[null,null,null,null,null,"",{"$f":"_xlfn.SWITCH(B117,\"(vide)\",\"\",ISBLANK(B117),\"\",B117)","v":0},0,0,null,null,"","","",""]
[null,null,null,null,null,"",{"$f":"_xlfn.SWITCH(B118,\"(vide)\",\"\",ISBLANK(B118),\"\",B118)","v":0},0,0,null,null,"","","",""]
[null,null,null,null,null,"",{"$f":"_xlfn.SWITCH(B119,\"(vide)\",\"\",ISBLANK(B119),\"\",B119)","v":0},0,0,null,null,"","","",""]
[null,null,null,null,null,"",{"$f":"_xlfn.SWITCH(B120,\"(vide)\",\"\",ISBLANK(B120),\"\",B120)","v":0},0,0,null,null,"","","",""]
[null,null,null,null,null,"",{"$f":"_xlfn.SWITCH(B121,\"(vide)\",\"\",ISBLANK(B121),\"\",B121)","v":0},0,0,null,null,"","","",""]
[null,null,null,null,null,"",{"$f":"_xlfn.SWITCH(B122,\"(vide)\",\"\",ISBLANK(B122),\"\",B122)","v":0},0,0,null,null,"","","",""]
[null,null,null,null,null,"",{"$f":"_xlfn.SWITCH(B123,\"(vide)\",\"\",ISBLANK(B123),\"\",B123)","v":0},0,0,null,null,"","","",""]
[null,null,null,null,null,"",{"$f":"_xlfn.SWITCH(B124,\"(vide)\",\"\",ISBLANK(B124),\"\",B124)","v":0},0,0,null,null,"","","",""]
[null,null,null,null,null,"",{"$f":"_xlfn.SWITCH(B125,\"(vide)\",\"\",ISBLANK(B125),\"\",B125)","v":0},0,0,null,null,"","","",""]
[null,null,null,null,null,"",{"$f":"_xlfn.SWITCH(B126,\"(vide)\",\"\",ISBLANK(B126),\"\",B126)","v":0},0,0,null,null,"","","",""]
[null,null,null,null,null,"",{"$f":"_xlfn.SWITCH(B127,\"(vide)\",\"\",ISBLANK(B127),\"\",B127)","v":0},0,0,null,null,"","","",""]
[null,null,null,null,null,"",{"$f":"_xlfn.SWITCH(B128,\"(vide)\",\"\",ISBLANK(B128),\"\",B128)","v":0},0,0,null,null,"","","",""]
[null,null,null,null,null,"",{"$f":"_xlfn.SWITCH(B129,\"(vide)\",\"\",ISBLANK(B129),\"\",B129)","v":0},0,0,null,null,"","","",""]
[null,null,null,null,null,"",{"$f":"_xlfn.SWITCH(B130,\"(vide)\",\"\",ISBLANK(B130),\"\",B130)","v":0},0,0,null,null,"","","",""]
[null,null,null,null,null,{"$f":"IF(A131=\"\",\"\",A131)","v":""},{"$f":"_xlfn.SWITCH(B131,\"(vide)\",\"\",ISBLANK(B131),\"\",B131)","v":0},0,0,null,null,"","","",""]
[null,null,null,null,null,"",{"$f":"_xlfn.SWITCH(B132,\"(vide)\",\"\",ISBLANK(B132),\"\",B132)","v":0},0,0,null,null,{"$f":"IF(F132=0,\"\",F132)","v":""},"","",""]
[null,null,null,null,null,"",{"$f":"_xlfn.SWITCH(B133,\"(vide)\",\"\",ISBLANK(B133),\"\",B133)","v":0},0,0,null,null,"","","",""]
[null,null,null,null,null,"",{"$f":"_xlfn.SWITCH(B134,\"(vide)\",\"\",ISBLANK(B134),\"\",B134)","v":0},0,0,null,null,"","","",""]
[null,null,null,null,null,"",{"$f":"_xlfn.SWITCH(B135,\"(vide)\",\"\",ISBLANK(B135),\"\",B135)","v":0},0,0,null,null,"","","",""]
[null,null,null,null,null,"",{"$f":"_xlfn.SWITCH(B136,\"(vide)\",\"\",ISBLANK(B136),\"\",B136)","v":0},0,0,null,null,"","","",""]
[null,null,null,null,null,"",{"$f":"_xlfn.SWITCH(B137,\"(vide)\",\"\",ISBLANK(B137),\"\",B137)","v":0},0,0,null,null,"","","",""]
[null,null,null,null,null,"",{"$f":"_xlfn.SWITCH(B138,\"(vide)\",\"\",ISBLANK(B138),\"\",B138)","v":0},0,0,null,null,"","","",""]
[null,null,null,null,null,"",{"$f":"_xlfn.SWITCH(B139,\"(vide)\",\"\",ISBLANK(B139),\"\",B139)","v":0},0,0,null,null,"","","",""]
[null,null,null,null,null,"",{"$f":"_xlfn.SWITCH(B140,\"(vide)\",\"\",ISBLANK(B140),\"\",B140)","v":0},0,0,null,null,"","","",""]
[null,null,null,null,null,"",{"$f":"_xlfn.SWITCH(B141,\"(vide)\",\"\",ISBLANK(B141),\"\",B141)","v":0},0,0,null,null,"","","",""]
[null,null,null,null,null,"",{"$f":"_xlfn.SWITCH(B142,\"(vide)\",\"\",ISBLANK(B142),\"\",B142)","v":0},0,0,null,null,"","","",""]

{"sheet":"Corse","index":13,"n_rows":1,"n_cols":1,"rows_kept":1,"cut":false,"hidden":false,"merged":[[0,0,2,22]]}
["REGION\nCORSE"]

{"sheet":"GE TCD","index":14,"n_rows":142,"n_cols":15,"rows_kept":142,"cut":false,"hidden":true,"merged":[]}
["Pays","Provinces","Départements","CENTRE",null,{"$f":"A1","v":"Pays"},{"$f":"B1","v":"Provinces"},{"$f":"C1","v":"Départements"},"CENTRE",null,null,{"$f":"IF(F1=0,\"\",F1)","v":"Pays"},"Provinces","Départements","CENTRE"]
["France","Grand Est","Ardennes","Charleville Montcy",null,{"$f":"IF(A2=\"\",\"\",A2)","v":"France"},{"$f":"IF(B2=\"(vide)\",\"\",B2)","v":"Grand Est"},"Ardennes","Charleville Montcy",null,null,"France","Grand Est","Ardennes","Charleville Montcy"]
["France","Grand Est","Ardennes","Rethel Acy Romance",null,{"$f":"IF(A3=\"\",\"\",A3)","v":"France"},{"$f":"IF(B3=\"(vide)\",\"\",B3)","v":"Grand Est"},"Ardennes","Rethel Acy Romance",null,null,{"$f":"IF(F3=0,\"\",F3)","v":"France"},{"$f":"IF(G3=0,\"\",G3)","v":"Grand Est"},{"$f":"IF(H3=0,\"\",H3)","v":"Ardennes"},{"$f":"IF(I3=0,\"\",I3)","v":"Rethel Acy Romance"}]
["France","Grand Est","Aube","Troyes Pont Ste Marie",null,"France","Grand Est","Aube","Troyes Pont Ste Marie",null,null,{"$f":"IF(F4=0,\"\",F4)","v":"France"},"Grand Est","Aube","Troyes Pont Ste Marie"]
["France","Grand Est","Bas-Rhin","Strasbourg",null,"France",{"$f":"_xlfn.SWITCH(B5,\"(vide)\",\"\",ISBLANK(B5),\"\",B5)","v":"Grand Est"},"Bas-Rhin","Strasbourg",null,null,"France","Grand Est","Bas-Rhin","Strasbourg"]
["France","Grand Est","Haute-Marne","Saint Dizier",null,"France",{"$f":"_xlfn.SWITCH(B6,\"(vide)\",\"\",ISBLANK(B6),\"\",B6)","v":"Grand Est"},"Haute-Marne","Saint Dizier",null,null,"France","Grand Est","Haute-Marne","Saint Dizier"]
["France","Grand Est","Haut-Rhin","Colmar",null,"France",{"$f":"_xlfn.SWITCH(B7,\"(vide)\",\"\",ISBLANK(B7),\"\",B7)","v":"Grand Est"},"Haut-Rhin","Colmar",null,null,"France","Grand Est","Haut-Rhin","Colmar"]
["France","Grand Est","Haut-Rhin","Mulhouse",null,"France",{"$f":"_xlfn.SWITCH(B8,\"(vide)\",\"\",ISBLANK(B8),\"\",B8)","v":"Grand Est"},"Haut-Rhin","Mulhouse",null,null,"France","Grand Est","Haut-Rhin","Mulhouse"]
["France","Grand Est","Marne","Reims",null,"France",{"$f":"_xlfn.SWITCH(B9,\"(vide)\",\"\",ISBLANK(B9),\"\",B9)","v":"Grand Est"},"Marne","Reims",null,null,"France","Grand Est","Marne","Reims"]
["France","Grand Est","Meurthe-et-Moselle","Nancy Laxou",null,"France",{"$f":"_xlfn.SWITCH(B10,\"(vide)\",\"\",ISBLANK(B10),\"\",B10)","v":"Grand Est"},"Meurthe-et-Moselle","Nancy Laxou",null,null,"France","Grand Est","Meurthe-et-Moselle","Nancy Laxou"]
["France","Grand Est","Meurthe-et-Moselle","Pompey",null,"France",{"$f":"_xlfn.SWITCH(B11,\"(vide)\",\"\",ISBLANK(B11),\"\",B11)","v":"Grand Est"},"Meurthe-et-Moselle","Pompey",null,null,"France","Grand Est","Meurthe-et-Moselle","Pompey"]
["France","Grand Est","Meuse","Verdun",null,"France",{"$f":"_xlfn.SWITCH(B12,\"(vide)\",\"\",ISBLANK(B12),\"\",B12)","v":"Grand Est"},"Meuse","Verdun",null,null,"France","Grand Est","Meuse","Verdun"]
["France","Grand Est","Moselle","Metz",null,"France",{"$f":"_xlfn.SWITCH(B13,\"(vide)\",\"\",ISBLANK(B13),\"\",B13)","v":"Grand Est"},"Moselle","Metz",null,null,"France","Grand Est","Moselle","Metz"]
["France","Grand Est","Moselle","Saint Avold",null,"France",{"$f":"_xlfn.SWITCH(B14,\"(vide)\",\"\",ISBLANK(B14),\"\",B14)","v":"Grand Est"},"Moselle","Saint Avold",null,null,"France","Grand Est","Moselle","Saint Avold"]
["France","Grand Est","Moselle","Thionville Yutz",null,"France",{"$f":"_xlfn.SWITCH(B15,\"(vide)\",\"\",ISBLANK(B15),\"\",B15)","v":"Grand Est"},"Moselle","Thionville Yutz",null,null,"France","Grand Est","Moselle","Thionville Yutz"]
["France","Grand Est","Vosges","Epinal Golbey",null,"France",{"$f":"_xlfn.SWITCH(B16,\"(vide)\",\"\",ISBLANK(B16),\"\",B16)","v":"Grand Est"},"Vosges","Epinal Golbey",null,null,"France","Grand Est","Vosges","Epinal Golbey"]
["France","Grand Est","Vosges","Remiremont",null,"France",{"$f":"_xlfn.SWITCH(B17,\"(vide)\",\"\",ISBLANK(B17),\"\",B17)","v":"Grand Est"},{"$f":"C17","v":"Vosges"},"Remiremont",null,null,"France","Grand Est","Vosges","Remiremont"]
[null,null,null,null,null,"",{"$f":"_xlfn.SWITCH(B18,\"(vide)\",\"\",ISBLANK(B18),\"\",B18)","v":0},0,0,null,null,"","","",""]
[null,null,null,null,null,"",{"$f":"_xlfn.SWITCH(B19,\"(vide)\",\"\",ISBLANK(B19),\"\",B19)","v":0},0,0,null,null,"","","",""]
[null,null,null,null,null,"",{"$f":"_xlfn.SWITCH(B20,\"(vide)\",\"\",ISBLANK(B20),\"\",B20)","v":0},0,0,null,null,"","","",""]
[null,null,null,null,null,"",{"$f":"_xlfn.SWITCH(B21,\"(vide)\",\"\",ISBLANK(B21),\"\",B21)","v":0},0,0,null,null,"","","",""]
[null,null,null,null,null,"",{"$f":"_xlfn.SWITCH(B22,\"(vide)\",\"\",ISBLANK(B22),\"\",B22)","v":0},0,0,null,null,"","","",""]
[null,null,null,null,null,"",{"$f":"_xlfn.SWITCH(B23,\"(vide)\",\"\",ISBLANK(B23),\"\",B23)","v":0},0,0,null,null,"","","",""]
[null,null,null,null,null,"",{"$f":"_xlfn.SWITCH(B24,\"(vide)\",\"\",ISBLANK(B24),\"\",B24)","v":0},0,0,null,null,"","","",""]
[null,null,null,null,null,"",{"$f":"_xlfn.SWITCH(B25,\"(vide)\",\"\",ISBLANK(B25),\"\",B25)","v":0},0,0,null,null,"","","",""]
[null,null,null,null,null,"",{"$f":"_xlfn.SWITCH(B26,\"(vide)\",\"\",ISBLANK(B26),\"\",B26)","v":0},0,0,null,null,"","","",""]
[null,null,null,null,null,"",{"$f":"_xlfn.SWITCH(B27,\"(vide)\",\"\",ISBLANK(B27),\"\",B27)","v":0},0,0,null,null,"","","",""]
[null,null,null,null,null,"",{"$f":"_xlfn.SWITCH(B28,\"(vide)\",\"\",ISBLANK(B28),\"\",B28)","v":0},0,0,null,null,"","","",""]
[null,null,null,null,null,"",{"$f":"_xlfn.SWITCH(B29,\"(vide)\",\"\",ISBLANK(B29),\"\",B29)","v":0},0,0,null,null,"","","",""]
[null,null,null,null,null,"",{"$f":"_xlfn.SWITCH(B30,\"(vide)\",\"\",ISBLANK(B30),\"\",B30)","v":0},0,0,null,null,"","","",""]
[null,null,null,null,null,"",{"$f":"_xlfn.SWITCH(B31,\"(vide)\",\"\",ISBLANK(B31),\"\",B31)","v":0},0,0,null,null,"","","",""]
[null,null,null,null,null,"",{"$f":"_xlfn.SWITCH(B32,\"(vide)\",\"\",ISBLANK(B32),\"\",B32)","v":0},0,0,null,null,"","","",""]
[null,null,null,null,null,"",{"$f":"_xlfn.SWITCH(B33,\"(vide)\",\"\",ISBLANK(B33),\"\",B33)","v":0},0,0,null,null,"","","",""]
[null,null,null,null,null,"",{"$f":"_xlfn.SWITCH(B34,\"(vide)\",\"\",ISBLANK(B34),\"\",B34)","v":0},0,0,null,null,"","","",""]
[null,null,null,null,null,"",{"$f":"_xlfn.SWITCH(B35,\"(vide)\",\"\",ISBLANK(B35),\"\",B35)","v":0},0,0,null,null,"","","",""]
[null,null,null,null,null,"",{"$f":"_xlfn.SWITCH(B36,\"(vide)\",\"\",ISBLANK(B36),\"\",B36)","v":0},0,0,null,null,"","","",""]
[null,null,null,null,null,"",{"$f":"_xlfn.SWITCH(B37,\"(vide)\",\"\",ISBLANK(B37),\"\",B37)","v":0},0,0,null,null,"","","",""]
[null,null,null,null,null,"",{"$f":"_xlfn.SWITCH(B38,\"(vide)\",\"\",ISBLANK(B38),\"\",B38)","v":0},0,0,null,null,"","","",""]
[null,null,null,null,null,"",{"$f":"_xlfn.SWITCH(B39,\"(vide)\",\"\",ISBLANK(B39),\"\",B39)","v":0},0,0,null,null,"","","",""]
[null,null,null,null,null,"",{"$f":"_xlfn.SWITCH(B40,\"(vide)\",\"\",ISBLANK(B40),\"\",B40)","v":0},0,0,null,null,"","","",""]
[null,null,null,null,null,"",{"$f":"_xlfn.SWITCH(B41,\"(vide)\",\"\",ISBLANK(B41),\"\",B41)","v":0},0,0,null,null,"","","",""]
[null,null,null,null,null,"",{"$f":"_xlfn.SWITCH(B42,\"(vide)\",\"\",ISBLANK(B42),\"\",B42)","v":0},0,0,null,null,"","","",""]
[null,null,null,null,null,"",{"$f":"_xlfn.SWITCH(B43,\"(vide)\",\"\",ISBLANK(B43),\"\",B43)","v":0},0,0,null,null,"","","",""]
[null,null,null,null,null,"",{"$f":"_xlfn.SWITCH(B44,\"(vide)\",\"\",ISBLANK(B44),\"\",B44)","v":0},0,0,null,null,"","","",""]
[null,null,null,null,null,"",{"$f":"_xlfn.SWITCH(B45,\"(vide)\",\"\",ISBLANK(B45),\"\",B45)","v":0},0,0,null,null,"","","",""]
[null,null,null,null,null,"",{"$f":"_xlfn.SWITCH(B46,\"(vide)\",\"\",ISBLANK(B46),\"\",B46)","v":0},0,0,null,null,"","","",""]
[null,null,null,null,null,"",{"$f":"_xlfn.SWITCH(B47,\"(vide)\",\"\",ISBLANK(B47),\"\",B47)","v":0},0,0,null,null,"","","",""]
[null,null,null,null,null,"",{"$f":"_xlfn.SWITCH(B48,\"(vide)\",\"\",ISBLANK(B48),\"\",B48)","v":0},0,0,null,null,"","","",""]
[null,null,null,null,null,"",{"$f":"_xlfn.SWITCH(B49,\"(vide)\",\"\",ISBLANK(B49),\"\",B49)","v":0},0,0,null,null,"","","",""]
[null,null,null,null,null,"",{"$f":"_xlfn.SWITCH(B50,\"(vide)\",\"\",ISBLANK(B50),\"\",B50)","v":0},0,0,null,null,"","","",""]
[null,null,null,null,null,"",{"$f":"_xlfn.SWITCH(B51,\"(vide)\",\"\",ISBLANK(B51),\"\",B51)","v":0},0,0,null,null,"","","",""]
[null,null,null,null,null,"",{"$f":"_xlfn.SWITCH(B52,\"(vide)\",\"\",ISBLANK(B52),\"\",B52)","v":0},0,0,null,null,"","","",""]
[null,null,null,null,null,"",{"$f":"_xlfn.SWITCH(B53,\"(vide)\",\"\",ISBLANK(B53),\"\",B53)","v":0},0,0,null,null,"","","",""]
[null,null,null,null,null,"",{"$f":"_xlfn.SWITCH(B54,\"(vide)\",\"\",ISBLANK(B54),\"\",B54)","v":0},0,0,null,null,"","","",""]
[null,null,null,null,null,"",{"$f":"_xlfn.SWITCH(B55,\"(vide)\",\"\",ISBLANK(B55),\"\",B55)","v":0},0,0,null,null,"","","",""]
[null,null,null,null,null,"",{"$f":"_xlfn.SWITCH(B56,\"(vide)\",\"\",ISBLANK(B56),\"\",B56)","v":0},0,0,null,null,"","","",""]
[null,null,null,null,null,"",{"$f":"_xlfn.SWITCH(B57,\"(vide)\",\"\",ISBLANK(B57),\"\",B57)","v":0},0,0,null,null,"","","",""]
[null,null,null,null,null,"",{"$f":"_xlfn.SWITCH(B58,\"(vide)\",\"\",ISBLANK(B58),\"\",B58)","v":0},0,0,null,null,"","","",""]
[null,null,null,null,null,"",{"$f":"_xlfn.SWITCH(B59,\"(vide)\",\"\",ISBLANK(B59),\"\",B59)","v":0},0,0,null,null,"","","",""]
[null,null,null,null,null,"",{"$f":"_xlfn.SWITCH(B60,\"(vide)\",\"\",ISBLANK(B60),\"\",B60)","v":0},0,0,null,null,"","","",""]
[null,null,null,null,null,"",{"$f":"_xlfn.SWITCH(B61,\"(vide)\",\"\",ISBLANK(B61),\"\",B61)","v":0},0,0,null,null,"","","",""]
[null,null,null,null,null,"",{"$f":"_xlfn.SWITCH(B62,\"(vide)\",\"\",ISBLANK(B62),\"\",B62)","v":0},0,0,null,null,"","","",""]
[null,null,null,null,null,"",{"$f":"_xlfn.SWITCH(B63,\"(vide)\",\"\",ISBLANK(B63),\"\",B63)","v":0},0,0,null,null,"","","",""]
[null,null,null,null,null,"",{"$f":"_xlfn.SWITCH(B64,\"(vide)\",\"\",ISBLANK(B64),\"\",B64)","v":0},0,0,null,null,"","","",""]
[null,null,null,null,null,"",{"$f":"_xlfn.SWITCH(B65,\"(vide)\",\"\",ISBLANK(B65),\"\",B65)","v":0},0,0,null,null,"","","",""]
[null,null,null,null,null,"",{"$f":"_xlfn.SWITCH(B66,\"(vide)\",\"\",ISBLANK(B66),\"\",B66)","v":0},0,0,null,null,"","","",""]
[null,null,null,null,null,{"$f":"IF(A67=\"\",\"\",A67)","v":""},{"$f":"_xlfn.SWITCH(B67,\"(vide)\",\"\",ISBLANK(B67),\"\",B67)","v":0},0,0,null,null,"","","",{"$f":"IF(I67=0,\"\",I67)","v":""}]
[null,null,null,null,null,"",{"$f":"_xlfn.SWITCH(B68,\"(vide)\",\"\",ISBLANK(B68),\"\",B68)","v":0},0,0,null,null,{"$f":"IF(F68=0,\"\",F68)","v":""},"","",""]
[null,null,null,null,null,"",{"$f":"_xlfn.SWITCH(B69,\"(vide)\",\"\",ISBLANK(B69),\"\",B69)","v":0},0,0,null,null,"","","",""]
[null,null,null,null,null,"",{"$f":"_xlfn.SWITCH(B70,\"(vide)\",\"\",ISBLANK(B70),\"\",B70)","v":0},0,0,null,null,"","","",""]
[null,null,null,null,null,"",{"$f":"_xlfn.SWITCH(B71,\"(vide)\",\"\",ISBLANK(B71),\"\",B71)","v":0},0,0,null,null,"","","",""]
[null,null,null,null,null,"",{"$f":"_xlfn.SWITCH(B72,\"(vide)\",\"\",ISBLANK(B72),\"\",B72)","v":0},0,0,null,null,"","","",""]
[null,null,null,null,null,"",{"$f":"_xlfn.SWITCH(B73,\"(vide)\",\"\",ISBLANK(B73),\"\",B73)","v":0},0,0,null,null,"","","",""]
[null,null,null,null,null,"",{"$f":"_xlfn.SWITCH(B74,\"(vide)\",\"\",ISBLANK(B74),\"\",B74)","v":0},0,0,null,null,"","","",""]
[null,null,null,null,null,"",{"$f":"_xlfn.SWITCH(B75,\"(vide)\",\"\",ISBLANK(B75),\"\",B75)","v":0},0,0,null,null,"","","",""]
[null,null,null,null,null,"",{"$f":"_xlfn.SWITCH(B76,\"(vide)\",\"\",ISBLANK(B76),\"\",B76)","v":0},0,0,null,null,"","","",""]
[null,null,null,null,null,"",{"$f":"_xlfn.SWITCH(B77,\"(vide)\",\"\",ISBLANK(B77),\"\",B77)","v":0},0,0,null,null,"","","",""]
[null,null,null,null,null,"",{"$f":"_xlfn.SWITCH(B78,\"(vide)\",\"\",ISBLANK(B78),\"\",B78)","v":0},0,0,null,null,"","","",""]
[null,null,null,null,null,"",{"$f":"_xlfn.SWITCH(B79,\"(vide)\",\"\",ISBLANK(B79),\"\",B79)","v":0},0,0,null,null,"","","",""]
[null,null,null,null,null,"",{"$f":"_xlfn.SWITCH(B80,\"(vide)\",\"\",ISBLANK(B80),\"\",B80)","v":0},0,0,null,null,"","","",""]
[null,null,null,null,null,"",{"$f":"_xlfn.SWITCH(B81,\"(vide)\",\"\",ISBLANK(B81),\"\",B81)","v":0},{"$f":"C81","v":0},0,null,null,"","","",""]
[null,null,null,null,null,"",{"$f":"_xlfn.SWITCH(B82,\"(vide)\",\"\",ISBLANK(B82),\"\",B82)","v":0},0,0,null,null,"","","",""]
[null,null,null,null,null,"",{"$f":"_xlfn.SWITCH(B83,\"(vide)\",\"\",ISBLANK(B83),\"\",B83)","v":0},0,0,null,null,"","","",""]
[null,null,null,null,null,"",{"$f":"_xlfn.SWITCH(B84,\"(vide)\",\"\",ISBLANK(B84),\"\",B84)","v":0},0,0,null,null,"","","",""]
[null,null,null,null,null,"",{"$f":"_xlfn.SWITCH(B85,\"(vide)\",\"\",ISBLANK(B85),\"\",B85)","v":0},0,0,null,null,"","","",""]
[null,null,null,null,null,"",{"$f":"_xlfn.SWITCH(B86,\"(vide)\",\"\",ISBLANK(B86),\"\",B86)","v":0},0,0,null,null,"","","",""]
[null,null,null,null,null,"",{"$f":"_xlfn.SWITCH(B87,\"(vide)\",\"\",ISBLANK(B87),\"\",B87)","v":0},0,0,null,null,"","","",""]
[null,null,null,null,null,"",{"$f":"_xlfn.SWITCH(B88,\"(vide)\",\"\",ISBLANK(B88),\"\",B88)","v":0},0,0,null,null,"","","",""]
[null,null,null,null,null,"",{"$f":"_xlfn.SWITCH(B89,\"(vide)\",\"\",ISBLANK(B89),\"\",B89)","v":0},0,0,null,null,"","","",""]
[null,null,null,null,null,"",{"$f":"_xlfn.SWITCH(B90,\"(vide)\",\"\",ISBLANK(B90),\"\",B90)","v":0},0,0,null,null,"","","",""]
[null,null,null,null,null,"",{"$f":"_xlfn.SWITCH(B91,\"(vide)\",\"\",ISBLANK(B91),\"\",B91)","v":0},0,0,null,null,"","","",""]
[null,null,null,null,null,"",{"$f":"_xlfn.SWITCH(B92,\"(vide)\",\"\",ISBLANK(B92),\"\",B92)","v":0},0,0,null,null,"","","",""]
[null,null,null,null,null,"",{"$f":"_xlfn.SWITCH(B93,\"(vide)\",\"\",ISBLANK(B93),\"\",B93)","v":0},0,0,null,null,"","","",""]
[null,null,null,null,null,"",{"$f":"_xlfn.SWITCH(B94,\"(vide)\",\"\",ISBLANK(B94),\"\",B94)","v":0},0,0,null,null,"","","",""]
[null,null,null,null,null,"",{"$f":"_xlfn.SWITCH(B95,\"(vide)\",\"\",ISBLANK(B95),\"\",B95)","v":0},0,0,null,null,"","","",""]
[null,null,null,null,null,"",{"$f":"_xlfn.SWITCH(B96,\"(vide)\",\"\",ISBLANK(B96),\"\",B96)","v":0},0,0,null,null,"","","",""]
[null,null,null,null,null,"",{"$f":"_xlfn.SWITCH(B97,\"(vide)\",\"\",ISBLANK(B97),\"\",B97)","v":0},0,0,null,null,"","","",""]
[null,null,null,null,null,"",{"$f":"_xlfn.SWITCH(B98,\"(vide)\",\"\",ISBLANK(B98),\"\",B98)","v":0},0,0,null,null,"","","",""]
[null,null,null,null,null,"",{"$f":"_xlfn.SWITCH(B99,\"(vide)\",\"\",ISBLANK(B99),\"\",B99)","v":0},0,0,null,null,"","","",""]
[null,null,null,null,null,"",{"$f":"_xlfn.SWITCH(B100,\"(vide)\",\"\",ISBLANK(B100),\"\",B100)","v":0},0,0,null,null,"","","",""]
[null,null,null,null,null,"",{"$f":"_xlfn.SWITCH(B101,\"(vide)\",\"\",ISBLANK(B101),\"\",B101)","v":0},0,0,null,null,"","","",""]
[null,null,null,null,null,"",{"$f":"_xlfn.SWITCH(B102,\"(vide)\",\"\",ISBLANK(B102),\"\",B102)","v":0},0,0,null,null,"","","",""]
[null,null,null,null,null,"",{"$f":"_xlfn.SWITCH(B103,\"(vide)\",\"\",ISBLANK(B103),\"\",B103)","v":0},0,0,null,null,"","","",""]
[null,null,null,null,null,"",{"$f":"_xlfn.SWITCH(B104,\"(vide)\",\"\",ISBLANK(B104),\"\",B104)","v":0},0,0,null,null,"","","",""]
[null,null,null,null,null,"",{"$f":"_xlfn.SWITCH(B105,\"(vide)\",\"\",ISBLANK(B105),\"\",B105)","v":0},0,0,null,null,"","","",""]
[null,null,null,null,null,"",{"$f":"_xlfn.SWITCH(B106,\"(vide)\",\"\",ISBLANK(B106),\"\",B106)","v":0},0,0,null,null,"","","",""]
[null,null,null,null,null,"",{"$f":"_xlfn.SWITCH(B107,\"(vide)\",\"\",ISBLANK(B107),\"\",B107)","v":0},0,0,null,null,"","","",""]
[null,null,null,null,null,"",{"$f":"_xlfn.SWITCH(B108,\"(vide)\",\"\",ISBLANK(B108),\"\",B108)","v":0},0,0,null,null,"","","",""]
[null,null,null,null,null,"",{"$f":"_xlfn.SWITCH(B109,\"(vide)\",\"\",ISBLANK(B109),\"\",B109)","v":0},0,0,null,null,"","","",""]
[null,null,null,null,null,"",{"$f":"_xlfn.SWITCH(B110,\"(vide)\",\"\",ISBLANK(B110),\"\",B110)","v":0},0,0,null,null,"","","",""]
[null,null,null,null,null,"",{"$f":"_xlfn.SWITCH(B111,\"(vide)\",\"\",ISBLANK(B111),\"\",B111)","v":0},0,0,null,null,"","","",""]
[null,null,null,null,null,"",{"$f":"_xlfn.SWITCH(B112,\"(vide)\",\"\",ISBLANK(B112),\"\",B112)","v":0},0,0,null,null,"","","",""]
[null,null,null,null,null,"",{"$f":"_xlfn.SWITCH(B113,\"(vide)\",\"\",ISBLANK(B113),\"\",B113)","v":0},0,0,null,null,"","","",""]
[null,null,null,null,null,"",{"$f":"_xlfn.SWITCH(B114,\"(vide)\",\"\",ISBLANK(B114),\"\",B114)","v":0},0,0,null,null,"","","",""]
[null,null,null,null,null,"",{"$f":"_xlfn.SWITCH(B115,\"(vide)\",\"\",ISBLANK(B115),\"\",B115)","v":0},0,0,null,null,"","","",""]
[null,null,null,null,null,"",{"$f":"_xlfn.SWITCH(B116,\"(vide)\",\"\",ISBLANK(B116),\"\",B116)","v":0},0,0,null,null,"","","",""]
[null,null,null,null,null,"",{"$f":"_xlfn.SWITCH(B117,\"(vide)\",\"\",ISBLANK(B117),\"\",B117)","v":0},0,0,null,null,"","","",""]
[null,null,null,null,null,"",{"$f":"_xlfn.SWITCH(B118,\"(vide)\",\"\",ISBLANK(B118),\"\",B118)","v":0},0,0,null,null,"","","",""]
[null,null,null,null,null,"",{"$f":"_xlfn.SWITCH(B119,\"(vide)\",\"\",ISBLANK(B119),\"\",B119)","v":0},0,0,null,null,"","","",""]
[null,null,null,null,null,"",{"$f":"_xlfn.SWITCH(B120,\"(vide)\",\"\",ISBLANK(B120),\"\",B120)","v":0},0,0,null,null,"","","",""]
[null,null,null,null,null,"",{"$f":"_xlfn.SWITCH(B121,\"(vide)\",\"\",ISBLANK(B121),\"\",B121)","v":0},0,0,null,null,"","","",""]
[null,null,null,null,null,"",{"$f":"_xlfn.SWITCH(B122,\"(vide)\",\"\",ISBLANK(B122),\"\",B122)","v":0},0,0,null,null,"","","",""]
[null,null,null,null,null,"",{"$f":"_xlfn.SWITCH(B123,\"(vide)\",\"\",ISBLANK(B123),\"\",B123)","v":0},0,0,null,null,"","","",""]
[null,null,null,null,null,"",{"$f":"_xlfn.SWITCH(B124,\"(vide)\",\"\",ISBLANK(B124),\"\",B124)","v":0},0,0,null,null,"","","",""]
[null,null,null,null,null,"",{"$f":"_xlfn.SWITCH(B125,\"(vide)\",\"\",ISBLANK(B125),\"\",B125)","v":0},0,0,null,null,"","","",""]
[null,null,null,null,null,"",{"$f":"_xlfn.SWITCH(B126,\"(vide)\",\"\",ISBLANK(B126),\"\",B126)","v":0},0,0,null,null,"","","",""]
[null,null,null,null,null,"",{"$f":"_xlfn.SWITCH(B127,\"(vide)\",\"\",ISBLANK(B127),\"\",B127)","v":0},0,0,null,null,"","","",""]
[null,null,null,null,null,"",{"$f":"_xlfn.SWITCH(B128,\"(vide)\",\"\",ISBLANK(B128),\"\",B128)","v":0},0,0,null,null,"","","",""]
[null,null,null,null,null,"",{"$f":"_xlfn.SWITCH(B129,\"(vide)\",\"\",ISBLANK(B129),\"\",B129)","v":0},0,0,null,null,"","","",""]
[null,null,null,null,null,"",{"$f":"_xlfn.SWITCH(B130,\"(vide)\",\"\",ISBLANK(B130),\"\",B130)","v":0},0,0,null,null,"","","",""]
[null,null,null,null,null,{"$f":"IF(A131=\"\",\"\",A131)","v":""},{"$f":"_xlfn.SWITCH(B131,\"(vide)\",\"\",ISBLANK(B131),\"\",B131)","v":0},0,0,null,null,"","","",""]
[null,null,null,null,null,"",{"$f":"_xlfn.SWITCH(B132,\"(vide)\",\"\",ISBLANK(B132),\"\",B132)","v":0},0,0,null,null,{"$f":"IF(F132=0,\"\",F132)","v":""},"","",""]
[null,null,null,null,null,"",{"$f":"_xlfn.SWITCH(B133,\"(vide)\",\"\",ISBLANK(B133),\"\",B133)","v":0},0,0,null,null,"","","",""]
[null,null,null,null,null,"",{"$f":"_xlfn.SWITCH(B134,\"(vide)\",\"\",ISBLANK(B134),\"\",B134)","v":0},0,0,null,null,"","","",""]
[null,null,null,null,null,"",{"$f":"_xlfn.SWITCH(B135,\"(vide)\",\"\",ISBLANK(B135),\"\",B135)","v":0},0,0,null,null,"","","",""]
[null,null,null,null,null,"",{"$f":"_xlfn.SWITCH(B136,\"(vide)\",\"\",ISBLANK(B136),\"\",B136)","v":0},0,0,null,null,"","","",""]
[null,null,null,null,null,"",{"$f":"_xlfn.SWITCH(B137,\"(vide)\",\"\",ISBLANK(B137),\"\",B137)","v":0},0,0,null,null,"","","",""]
[null,null,null,null,null,"",{"$f":"_xlfn.SWITCH(B138,\"(vide)\",\"\",ISBLANK(B138),\"\",B138)","v":0},0,0,null,null,"","","",""]
[null,null,null,null,null,"",{"$f":"_xlfn.SWITCH(B139,\"(vide)\",\"\",ISBLANK(B139),\"\",B139)","v":0},0,0,null,null,"","","",""]
[null,null,null,null,null,"",{"$f":"_xlfn.SWITCH(B140,\"(vide)\",\"\",ISBLANK(B140),\"\",B140)","v":0},0,0,null,null,"","","",""]
[null,null,null,null,null,"",{"$f":"_xlfn.SWITCH(B141,\"(vide)\",\"\",ISBLANK(B141),\"\",B141)","v":0},0,0,null,null,"","","",""]
[null,null,null,null,null,"",{"$f":"_xlfn.SWITCH(B142,\"(vide)\",\"\",ISBLANK(B142),\"\",B142)","v":0},0,0,null,null,"","","",""]

{"sheet":"GE","index":15,"n_rows":1,"n_cols":1,"rows_kept":1,"cut":false,"hidden":false,"merged":[[0,0,2,22]]}
["REGION\nGRAND EST"]

{"sheet":"HDF TCD","index":16,"n_rows":142,"n_cols":15,"rows_kept":142,"cut":false,"hidden":true,"merged":[]}
["Pays","Provinces","Départements","CENTRE",null,{"$f":"A1","v":"Pays"},{"$f":"B1","v":"Provinces"},{"$f":"C1","v":"Départements"},"CENTRE",null,null,{"$f":"IF(F1=0,\"\",F1)","v":"Pays"},"Provinces","Départements","CENTRE"]
["France","Hauts-de-France","Aisne","Laon",null,{"$f":"IF(A2=\"\",\"\",A2)","v":"France"},{"$f":"IF(B2=\"(vide)\",\"\",B2)","v":"Hauts-de-France"},"Aisne","Laon",null,null,"France","Hauts-de-France","Aisne","Laon"]
["France","Hauts-de-France","Nord","Cambrai",null,{"$f":"IF(A3=\"\",\"\",A3)","v":"France"},{"$f":"IF(B3=\"(vide)\",\"\",B3)","v":"Hauts-de-France"},"Nord","Cambrai",null,null,{"$f":"IF(F3=0,\"\",F3)","v":"France"},{"$f":"IF(G3=0,\"\",G3)","v":"Hauts-de-France"},{"$f":"IF(H3=0,\"\",H3)","v":"Nord"},{"$f":"IF(I3=0,\"\",I3)","v":"Cambrai"}]
["France","Hauts-de-France","Nord","Douai Cantin",null,"France","Hauts-de-France","Nord","Douai Cantin",null,null,{"$f":"IF(F4=0,\"\",F4)","v":"France"},"Hauts-de-France","Nord","Douai Cantin"]
["France","Hauts-de-France","Nord","Dunkerque",null,"France",{"$f":"_xlfn.SWITCH(B5,\"(vide)\",\"\",ISBLANK(B5),\"\",B5)","v":"Hauts-de-France"},"Nord","Dunkerque",null,null,"France","Hauts-de-France","Nord","Dunkerque"]
["France","Hauts-de-France","Nord","Hazebrouck",null,"France",{"$f":"_xlfn.SWITCH(B6,\"(vide)\",\"\",ISBLANK(B6),\"\",B6)","v":"Hauts-de-France"},"Nord","Hazebrouck",null,null,"France","Hauts-de-France","Nord","Hazebrouck"]
["France","Hauts-de-France","Nord","Lille Lomme",null,"France",{"$f":"_xlfn.SWITCH(B7,\"(vide)\",\"\",ISBLANK(B7),\"\",B7)","v":"Hauts-de-France"},"Nord","Lille Lomme",null,null,"France","Hauts-de-France","Nord","Lille Lomme"]
["France","Hauts-de-France","Nord","Maubeuge Rousies",null,"France",{"$f":"_xlfn.SWITCH(B8,\"(vide)\",\"\",ISBLANK(B8),\"\",B8)","v":"Hauts-de-France"},"Nord","Maubeuge Rousies",null,null,"France","Hauts-de-France","Nord","Maubeuge Rousies"]
["France","Hauts-de-France","Nord","Roubaix",null,"France",{"$f":"_xlfn.SWITCH(B9,\"(vide)\",\"\",ISBLANK(B9),\"\",B9)","v":"Hauts-de-France"},"Nord","Roubaix",null,null,"France","Hauts-de-France","Nord","Roubaix"]
["France","Hauts-de-France","Nord","Valenciennes Sentinelle",null,"France",{"$f":"_xlfn.SWITCH(B10,\"(vide)\",\"\",ISBLANK(B10),\"\",B10)","v":"Hauts-de-France"},"Nord","Valenciennes Sentinelle",null,null,"France","Hauts-de-France","Nord","Valenciennes Sentinelle"]
["France","Hauts-de-France","Oise","Compiègne",null,"France",{"$f":"_xlfn.SWITCH(B11,\"(vide)\",\"\",ISBLANK(B11),\"\",B11)","v":"Hauts-de-France"},"Oise","Compiègne",null,null,"France","Hauts-de-France","Oise","Compiègne"]
["France","Hauts-de-France","Oise","Creil",null,"France",{"$f":"_xlfn.SWITCH(B12,\"(vide)\",\"\",ISBLANK(B12),\"\",B12)","v":"Hauts-de-France"},"Oise","Creil",null,null,"France","Hauts-de-France","Oise","Creil"]
["France","Hauts-de-France","Pas-de-Calais","Arras",null,"France",{"$f":"_xlfn.SWITCH(B13,\"(vide)\",\"\",ISBLANK(B13),\"\",B13)","v":"Hauts-de-France"},"Pas-de-Calais","Arras",null,null,"France","Hauts-de-France","Pas-de-Calais","Arras"]
["France","Hauts-de-France","Pas-de-Calais","Calais",null,"France",{"$f":"_xlfn.SWITCH(B14,\"(vide)\",\"\",ISBLANK(B14),\"\",B14)","v":"Hauts-de-France"},"Pas-de-Calais","Calais",null,null,"France","Hauts-de-France","Pas-de-Calais","Calais"]
["France","Hauts-de-France","Pas-de-Calais","Liévin",null,"France",{"$f":"_xlfn.SWITCH(B15,\"(vide)\",\"\",ISBLANK(B15),\"\",B15)","v":"Hauts-de-France"},"Pas-de-Calais","Liévin",null,null,"France","Hauts-de-France","Pas-de-Calais","Liévin"]
["France","Hauts-de-France","Somme","Amiens",null,"France",{"$f":"_xlfn.SWITCH(B16,\"(vide)\",\"\",ISBLANK(B16),\"\",B16)","v":"Hauts-de-France"},"Somme","Amiens",null,null,"France","Hauts-de-France","Somme","Amiens"]
[null,null,null,null,null,"",{"$f":"_xlfn.SWITCH(B17,\"(vide)\",\"\",ISBLANK(B17),\"\",B17)","v":0},{"$f":"C17","v":0},0,null,null,"","","",""]
[null,null,null,null,null,"",{"$f":"_xlfn.SWITCH(B18,\"(vide)\",\"\",ISBLANK(B18),\"\",B18)","v":0},0,0,null,null,"","","",""]
[null,null,null,null,null,"",{"$f":"_xlfn.SWITCH(B19,\"(vide)\",\"\",ISBLANK(B19),\"\",B19)","v":0},0,0,null,null,"","","",""]
[null,null,null,null,null,"",{"$f":"_xlfn.SWITCH(B20,\"(vide)\",\"\",ISBLANK(B20),\"\",B20)","v":0},0,0,null,null,"","","",""]
[null,null,null,null,null,"",{"$f":"_xlfn.SWITCH(B21,\"(vide)\",\"\",ISBLANK(B21),\"\",B21)","v":0},0,0,null,null,"","","",""]
[null,null,null,null,null,"",{"$f":"_xlfn.SWITCH(B22,\"(vide)\",\"\",ISBLANK(B22),\"\",B22)","v":0},0,0,null,null,"","","",""]
[null,null,null,null,null,"",{"$f":"_xlfn.SWITCH(B23,\"(vide)\",\"\",ISBLANK(B23),\"\",B23)","v":0},0,0,null,null,"","","",""]
[null,null,null,null,null,"",{"$f":"_xlfn.SWITCH(B24,\"(vide)\",\"\",ISBLANK(B24),\"\",B24)","v":0},0,0,null,null,"","","",""]
[null,null,null,null,null,"",{"$f":"_xlfn.SWITCH(B25,\"(vide)\",\"\",ISBLANK(B25),\"\",B25)","v":0},0,0,null,null,"","","",""]
[null,null,null,null,null,"",{"$f":"_xlfn.SWITCH(B26,\"(vide)\",\"\",ISBLANK(B26),\"\",B26)","v":0},0,0,null,null,"","","",""]
[null,null,null,null,null,"",{"$f":"_xlfn.SWITCH(B27,\"(vide)\",\"\",ISBLANK(B27),\"\",B27)","v":0},0,0,null,null,"","","",""]
[null,null,null,null,null,"",{"$f":"_xlfn.SWITCH(B28,\"(vide)\",\"\",ISBLANK(B28),\"\",B28)","v":0},0,0,null,null,"","","",""]
[null,null,null,null,null,"",{"$f":"_xlfn.SWITCH(B29,\"(vide)\",\"\",ISBLANK(B29),\"\",B29)","v":0},0,0,null,null,"","","",""]
[null,null,null,null,null,"",{"$f":"_xlfn.SWITCH(B30,\"(vide)\",\"\",ISBLANK(B30),\"\",B30)","v":0},0,0,null,null,"","","",""]
[null,null,null,null,null,"",{"$f":"_xlfn.SWITCH(B31,\"(vide)\",\"\",ISBLANK(B31),\"\",B31)","v":0},0,0,null,null,"","","",""]
[null,null,null,null,null,"",{"$f":"_xlfn.SWITCH(B32,\"(vide)\",\"\",ISBLANK(B32),\"\",B32)","v":0},0,0,null,null,"","","",""]
[null,null,null,null,null,"",{"$f":"_xlfn.SWITCH(B33,\"(vide)\",\"\",ISBLANK(B33),\"\",B33)","v":0},0,0,null,null,"","","",""]
[null,null,null,null,null,"",{"$f":"_xlfn.SWITCH(B34,\"(vide)\",\"\",ISBLANK(B34),\"\",B34)","v":0},0,0,null,null,"","","",""]
[null,null,null,null,null,"",{"$f":"_xlfn.SWITCH(B35,\"(vide)\",\"\",ISBLANK(B35),\"\",B35)","v":0},0,0,null,null,"","","",""]
[null,null,null,null,null,"",{"$f":"_xlfn.SWITCH(B36,\"(vide)\",\"\",ISBLANK(B36),\"\",B36)","v":0},0,0,null,null,"","","",""]
[null,null,null,null,null,"",{"$f":"_xlfn.SWITCH(B37,\"(vide)\",\"\",ISBLANK(B37),\"\",B37)","v":0},0,0,null,null,"","","",""]
[null,null,null,null,null,"",{"$f":"_xlfn.SWITCH(B38,\"(vide)\",\"\",ISBLANK(B38),\"\",B38)","v":0},0,0,null,null,"","","",""]
[null,null,null,null,null,"",{"$f":"_xlfn.SWITCH(B39,\"(vide)\",\"\",ISBLANK(B39),\"\",B39)","v":0},0,0,null,null,"","","",""]
[null,null,null,null,null,"",{"$f":"_xlfn.SWITCH(B40,\"(vide)\",\"\",ISBLANK(B40),\"\",B40)","v":0},0,0,null,null,"","","",""]
[null,null,null,null,null,"",{"$f":"_xlfn.SWITCH(B41,\"(vide)\",\"\",ISBLANK(B41),\"\",B41)","v":0},0,0,null,null,"","","",""]
[null,null,null,null,null,"",{"$f":"_xlfn.SWITCH(B42,\"(vide)\",\"\",ISBLANK(B42),\"\",B42)","v":0},0,0,null,null,"","","",""]
[null,null,null,null,null,"",{"$f":"_xlfn.SWITCH(B43,\"(vide)\",\"\",ISBLANK(B43),\"\",B43)","v":0},0,0,null,null,"","","",""]
[null,null,null,null,null,"",{"$f":"_xlfn.SWITCH(B44,\"(vide)\",\"\",ISBLANK(B44),\"\",B44)","v":0},0,0,null,null,"","","",""]
[null,null,null,null,null,"",{"$f":"_xlfn.SWITCH(B45,\"(vide)\",\"\",ISBLANK(B45),\"\",B45)","v":0},0,0,null,null,"","","",""]
[null,null,null,null,null,"",{"$f":"_xlfn.SWITCH(B46,\"(vide)\",\"\",ISBLANK(B46),\"\",B46)","v":0},0,0,null,null,"","","",""]
[null,null,null,null,null,"",{"$f":"_xlfn.SWITCH(B47,\"(vide)\",\"\",ISBLANK(B47),\"\",B47)","v":0},0,0,null,null,"","","",""]
[null,null,null,null,null,"",{"$f":"_xlfn.SWITCH(B48,\"(vide)\",\"\",ISBLANK(B48),\"\",B48)","v":0},0,0,null,null,"","","",""]
[null,null,null,null,null,"",{"$f":"_xlfn.SWITCH(B49,\"(vide)\",\"\",ISBLANK(B49),\"\",B49)","v":0},0,0,null,null,"","","",""]
[null,null,null,null,null,"",{"$f":"_xlfn.SWITCH(B50,\"(vide)\",\"\",ISBLANK(B50),\"\",B50)","v":0},0,0,null,null,"","","",""]
[null,null,null,null,null,"",{"$f":"_xlfn.SWITCH(B51,\"(vide)\",\"\",ISBLANK(B51),\"\",B51)","v":0},0,0,null,null,"","","",""]
[null,null,null,null,null,"",{"$f":"_xlfn.SWITCH(B52,\"(vide)\",\"\",ISBLANK(B52),\"\",B52)","v":0},0,0,null,null,"","","",""]
[null,null,null,null,null,"",{"$f":"_xlfn.SWITCH(B53,\"(vide)\",\"\",ISBLANK(B53),\"\",B53)","v":0},0,0,null,null,"","","",""]
[null,null,null,null,null,"",{"$f":"_xlfn.SWITCH(B54,\"(vide)\",\"\",ISBLANK(B54),\"\",B54)","v":0},0,0,null,null,"","","",""]
[null,null,null,null,null,"",{"$f":"_xlfn.SWITCH(B55,\"(vide)\",\"\",ISBLANK(B55),\"\",B55)","v":0},0,0,null,null,"","","",""]
[null,null,null,null,null,"",{"$f":"_xlfn.SWITCH(B56,\"(vide)\",\"\",ISBLANK(B56),\"\",B56)","v":0},0,0,null,null,"","","",""]
[null,null,null,null,null,"",{"$f":"_xlfn.SWITCH(B57,\"(vide)\",\"\",ISBLANK(B57),\"\",B57)","v":0},0,0,null,null,"","","",""]
[null,null,null,null,null,"",{"$f":"_xlfn.SWITCH(B58,\"(vide)\",\"\",ISBLANK(B58),\"\",B58)","v":0},0,0,null,null,"","","",""]
[null,null,null,null,null,"",{"$f":"_xlfn.SWITCH(B59,\"(vide)\",\"\",ISBLANK(B59),\"\",B59)","v":0},0,0,null,null,"","","",""]
[null,null,null,null,null,"",{"$f":"_xlfn.SWITCH(B60,\"(vide)\",\"\",ISBLANK(B60),\"\",B60)","v":0},0,0,null,null,"","","",""]
[null,null,null,null,null,"",{"$f":"_xlfn.SWITCH(B61,\"(vide)\",\"\",ISBLANK(B61),\"\",B61)","v":0},0,0,null,null,"","","",""]
[null,null,null,null,null,"",{"$f":"_xlfn.SWITCH(B62,\"(vide)\",\"\",ISBLANK(B62),\"\",B62)","v":0},0,0,null,null,"","","",""]
[null,null,null,null,null,"",{"$f":"_xlfn.SWITCH(B63,\"(vide)\",\"\",ISBLANK(B63),\"\",B63)","v":0},0,0,null,null,"","","",""]
[null,null,null,null,null,"",{"$f":"_xlfn.SWITCH(B64,\"(vide)\",\"\",ISBLANK(B64),\"\",B64)","v":0},0,0,null,null,"","","",""]
[null,null,null,null,null,"",{"$f":"_xlfn.SWITCH(B65,\"(vide)\",\"\",ISBLANK(B65),\"\",B65)","v":0},0,0,null,null,"","","",""]
[null,null,null,null,null,"",{"$f":"_xlfn.SWITCH(B66,\"(vide)\",\"\",ISBLANK(B66),\"\",B66)","v":0},0,0,null,null,"","","",""]
[null,null,null,null,null,{"$f":"IF(A67=\"\",\"\",A67)","v":""},{"$f":"_xlfn.SWITCH(B67,\"(vide)\",\"\",ISBLANK(B67),\"\",B67)","v":0},0,0,null,null,"","","",{"$f":"IF(I67=0,\"\",I67)","v":""}]
[null,null,null,null,null,"",{"$f":"_xlfn.SWITCH(B68,\"(vide)\",\"\",ISBLANK(B68),\"\",B68)","v":0},0,0,null,null,{"$f":"IF(F68=0,\"\",F68)","v":""},"","",""]
[null,null,null,null,null,"",{"$f":"_xlfn.SWITCH(B69,\"(vide)\",\"\",ISBLANK(B69),\"\",B69)","v":0},0,0,null,null,"","","",""]
[null,null,null,null,null,"",{"$f":"_xlfn.SWITCH(B70,\"(vide)\",\"\",ISBLANK(B70),\"\",B70)","v":0},0,0,null,null,"","","",""]
[null,null,null,null,null,"",{"$f":"_xlfn.SWITCH(B71,\"(vide)\",\"\",ISBLANK(B71),\"\",B71)","v":0},0,0,null,null,"","","",""]
[null,null,null,null,null,"",{"$f":"_xlfn.SWITCH(B72,\"(vide)\",\"\",ISBLANK(B72),\"\",B72)","v":0},0,0,null,null,"","","",""]
[null,null,null,null,null,"",{"$f":"_xlfn.SWITCH(B73,\"(vide)\",\"\",ISBLANK(B73),\"\",B73)","v":0},0,0,null,null,"","","",""]
[null,null,null,null,null,"",{"$f":"_xlfn.SWITCH(B74,\"(vide)\",\"\",ISBLANK(B74),\"\",B74)","v":0},0,0,null,null,"","","",""]
[null,null,null,null,null,"",{"$f":"_xlfn.SWITCH(B75,\"(vide)\",\"\",ISBLANK(B75),\"\",B75)","v":0},0,0,null,null,"","","",""]
[null,null,null,null,null,"",{"$f":"_xlfn.SWITCH(B76,\"(vide)\",\"\",ISBLANK(B76),\"\",B76)","v":0},0,0,null,null,"","","",""]
[null,null,null,null,null,"",{"$f":"_xlfn.SWITCH(B77,\"(vide)\",\"\",ISBLANK(B77),\"\",B77)","v":0},0,0,null,null,"","","",""]
[null,null,null,null,null,"",{"$f":"_xlfn.SWITCH(B78,\"(vide)\",\"\",ISBLANK(B78),\"\",B78)","v":0},0,0,null,null,"","","",""]
[null,null,null,null,null,"",{"$f":"_xlfn.SWITCH(B79,\"(vide)\",\"\",ISBLANK(B79),\"\",B79)","v":0},0,0,null,null,"","","",""]
[null,null,null,null,null,"",{"$f":"_xlfn.SWITCH(B80,\"(vide)\",\"\",ISBLANK(B80),\"\",B80)","v":0},0,0,null,null,"","","",""]
[null,null,null,null,null,"",{"$f":"_xlfn.SWITCH(B81,\"(vide)\",\"\",ISBLANK(B81),\"\",B81)","v":0},{"$f":"C81","v":0},0,null,null,"","","",""]
[null,null,null,null,null,"",{"$f":"_xlfn.SWITCH(B82,\"(vide)\",\"\",ISBLANK(B82),\"\",B82)","v":0},0,0,null,null,"","","",""]
[null,null,null,null,null,"",{"$f":"_xlfn.SWITCH(B83,\"(vide)\",\"\",ISBLANK(B83),\"\",B83)","v":0},0,0,null,null,"","","",""]
[null,null,null,null,null,"",{"$f":"_xlfn.SWITCH(B84,\"(vide)\",\"\",ISBLANK(B84),\"\",B84)","v":0},0,0,null,null,"","","",""]
[null,null,null,null,null,"",{"$f":"_xlfn.SWITCH(B85,\"(vide)\",\"\",ISBLANK(B85),\"\",B85)","v":0},0,0,null,null,"","","",""]
[null,null,null,null,null,"",{"$f":"_xlfn.SWITCH(B86,\"(vide)\",\"\",ISBLANK(B86),\"\",B86)","v":0},0,0,null,null,"","","",""]
[null,null,null,null,null,"",{"$f":"_xlfn.SWITCH(B87,\"(vide)\",\"\",ISBLANK(B87),\"\",B87)","v":0},0,0,null,null,"","","",""]
[null,null,null,null,null,"",{"$f":"_xlfn.SWITCH(B88,\"(vide)\",\"\",ISBLANK(B88),\"\",B88)","v":0},0,0,null,null,"","","",""]
[null,null,null,null,null,"",{"$f":"_xlfn.SWITCH(B89,\"(vide)\",\"\",ISBLANK(B89),\"\",B89)","v":0},0,0,null,null,"","","",""]
[null,null,null,null,null,"",{"$f":"_xlfn.SWITCH(B90,\"(vide)\",\"\",ISBLANK(B90),\"\",B90)","v":0},0,0,null,null,"","","",""]
[null,null,null,null,null,"",{"$f":"_xlfn.SWITCH(B91,\"(vide)\",\"\",ISBLANK(B91),\"\",B91)","v":0},0,0,null,null,"","","",""]
[null,null,null,null,null,"",{"$f":"_xlfn.SWITCH(B92,\"(vide)\",\"\",ISBLANK(B92),\"\",B92)","v":0},0,0,null,null,"","","",""]
[null,null,null,null,null,"",{"$f":"_xlfn.SWITCH(B93,\"(vide)\",\"\",ISBLANK(B93),\"\",B93)","v":0},0,0,null,null,"","","",""]
[null,null,null,null,null,"",{"$f":"_xlfn.SWITCH(B94,\"(vide)\",\"\",ISBLANK(B94),\"\",B94)","v":0},0,0,null,null,"","","",""]
[null,null,null,null,null,"",{"$f":"_xlfn.SWITCH(B95,\"(vide)\",\"\",ISBLANK(B95),\"\",B95)","v":0},0,0,null,null,"","","",""]
[null,null,null,null,null,"",{"$f":"_xlfn.SWITCH(B96,\"(vide)\",\"\",ISBLANK(B96),\"\",B96)","v":0},0,0,null,null,"","","",""]
[null,null,null,null,null,"",{"$f":"_xlfn.SWITCH(B97,\"(vide)\",\"\",ISBLANK(B97),\"\",B97)","v":0},0,0,null,null,"","","",""]
[null,null,null,null,null,"",{"$f":"_xlfn.SWITCH(B98,\"(vide)\",\"\",ISBLANK(B98),\"\",B98)","v":0},0,0,null,null,"","","",""]
[null,null,null,null,null,"",{"$f":"_xlfn.SWITCH(B99,\"(vide)\",\"\",ISBLANK(B99),\"\",B99)","v":0},0,0,null,null,"","","",""]
[null,null,null,null,null,"",{"$f":"_xlfn.SWITCH(B100,\"(vide)\",\"\",ISBLANK(B100),\"\",B100)","v":0},0,0,null,null,"","","",""]
[null,null,null,null,null,"",{"$f":"_xlfn.SWITCH(B101,\"(vide)\",\"\",ISBLANK(B101),\"\",B101)","v":0},0,0,null,null,"","","",""]
[null,null,null,null,null,"",{"$f":"_xlfn.SWITCH(B102,\"(vide)\",\"\",ISBLANK(B102),\"\",B102)","v":0},0,0,null,null,"","","",""]
[null,null,null,null,null,"",{"$f":"_xlfn.SWITCH(B103,\"(vide)\",\"\",ISBLANK(B103),\"\",B103)","v":0},0,0,null,null,"","","",""]
[null,null,null,null,null,"",{"$f":"_xlfn.SWITCH(B104,\"(vide)\",\"\",ISBLANK(B104),\"\",B104)","v":0},0,0,null,null,"","","",""]
[null,null,null,null,null,"",{"$f":"_xlfn.SWITCH(B105,\"(vide)\",\"\",ISBLANK(B105),\"\",B105)","v":0},0,0,null,null,"","","",""]
[null,null,null,null,null,"",{"$f":"_xlfn.SWITCH(B106,\"(vide)\",\"\",ISBLANK(B106),\"\",B106)","v":0},0,0,null,null,"","","",""]
[null,null,null,null,null,"",{"$f":"_xlfn.SWITCH(B107,\"(vide)\",\"\",ISBLANK(B107),\"\",B107)","v":0},0,0,null,null,"","","",""]
[null,null,null,null,null,"",{"$f":"_xlfn.SWITCH(B108,\"(vide)\",\"\",ISBLANK(B108),\"\",B108)","v":0},0,0,null,null,"","","",""]
[null,null,null,null,null,"",{"$f":"_xlfn.SWITCH(B109,\"(vide)\",\"\",ISBLANK(B109),\"\",B109)","v":0},0,0,null,null,"","","",""]
[null,null,null,null,null,"",{"$f":"_xlfn.SWITCH(B110,\"(vide)\",\"\",ISBLANK(B110),\"\",B110)","v":0},0,0,null,null,"","","",""]
[null,null,null,null,null,"",{"$f":"_xlfn.SWITCH(B111,\"(vide)\",\"\",ISBLANK(B111),\"\",B111)","v":0},0,0,null,null,"","","",""]
[null,null,null,null,null,"",{"$f":"_xlfn.SWITCH(B112,\"(vide)\",\"\",ISBLANK(B112),\"\",B112)","v":0},0,0,null,null,"","","",""]
[null,null,null,null,null,"",{"$f":"_xlfn.SWITCH(B113,\"(vide)\",\"\",ISBLANK(B113),\"\",B113)","v":0},0,0,null,null,"","","",""]
[null,null,null,null,null,"",{"$f":"_xlfn.SWITCH(B114,\"(vide)\",\"\",ISBLANK(B114),\"\",B114)","v":0},0,0,null,null,"","","",""]
[null,null,null,null,null,"",{"$f":"_xlfn.SWITCH(B115,\"(vide)\",\"\",ISBLANK(B115),\"\",B115)","v":0},0,0,null,null,"","","",""]
[null,null,null,null,null,"",{"$f":"_xlfn.SWITCH(B116,\"(vide)\",\"\",ISBLANK(B116),\"\",B116)","v":0},0,0,null,null,"","","",""]
[null,null,null,null,null,"",{"$f":"_xlfn.SWITCH(B117,\"(vide)\",\"\",ISBLANK(B117),\"\",B117)","v":0},0,0,null,null,"","","",""]
[null,null,null,null,null,"",{"$f":"_xlfn.SWITCH(B118,\"(vide)\",\"\",ISBLANK(B118),\"\",B118)","v":0},0,0,null,null,"","","",""]
[null,null,null,null,null,"",{"$f":"_xlfn.SWITCH(B119,\"(vide)\",\"\",ISBLANK(B119),\"\",B119)","v":0},0,0,null,null,"","","",""]
[null,null,null,null,null,"",{"$f":"_xlfn.SWITCH(B120,\"(vide)\",\"\",ISBLANK(B120),\"\",B120)","v":0},0,0,null,null,"","","",""]
[null,null,null,null,null,"",{"$f":"_xlfn.SWITCH(B121,\"(vide)\",\"\",ISBLANK(B121),\"\",B121)","v":0},0,0,null,null,"","","",""]
[null,null,null,null,null,"",{"$f":"_xlfn.SWITCH(B122,\"(vide)\",\"\",ISBLANK(B122),\"\",B122)","v":0},0,0,null,null,"","","",""]
[null,null,null,null,null,"",{"$f":"_xlfn.SWITCH(B123,\"(vide)\",\"\",ISBLANK(B123),\"\",B123)","v":0},0,0,null,null,"","","",""]
[null,null,null,null,null,"",{"$f":"_xlfn.SWITCH(B124,\"(vide)\",\"\",ISBLANK(B124),\"\",B124)","v":0},0,0,null,null,"","","",""]
[null,null,null,null,null,"",{"$f":"_xlfn.SWITCH(B125,\"(vide)\",\"\",ISBLANK(B125),\"\",B125)","v":0},0,0,null,null,"","","",""]
[null,null,null,null,null,"",{"$f":"_xlfn.SWITCH(B126,\"(vide)\",\"\",ISBLANK(B126),\"\",B126)","v":0},0,0,null,null,"","","",""]
[null,null,null,null,null,"",{"$f":"_xlfn.SWITCH(B127,\"(vide)\",\"\",ISBLANK(B127),\"\",B127)","v":0},0,0,null,null,"","","",""]
[null,null,null,null,null,"",{"$f":"_xlfn.SWITCH(B128,\"(vide)\",\"\",ISBLANK(B128),\"\",B128)","v":0},0,0,null,null,"","","",""]
[null,null,null,null,null,"",{"$f":"_xlfn.SWITCH(B129,\"(vide)\",\"\",ISBLANK(B129),\"\",B129)","v":0},0,0,null,null,"","","",""]
[null,null,null,null,null,"",{"$f":"_xlfn.SWITCH(B130,\"(vide)\",\"\",ISBLANK(B130),\"\",B130)","v":0},0,0,null,null,"","","",""]
[null,null,null,null,null,{"$f":"IF(A131=\"\",\"\",A131)","v":""},{"$f":"_xlfn.SWITCH(B131,\"(vide)\",\"\",ISBLANK(B131),\"\",B131)","v":0},0,0,null,null,"","","",""]
[null,null,null,null,null,"",{"$f":"_xlfn.SWITCH(B132,\"(vide)\",\"\",ISBLANK(B132),\"\",B132)","v":0},0,0,null,null,{"$f":"IF(F132=0,\"\",F132)","v":""},"","",""]
[null,null,null,null,null,"",{"$f":"_xlfn.SWITCH(B133,\"(vide)\",\"\",ISBLANK(B133),\"\",B133)","v":0},0,0,null,null,"","","",""]
[null,null,null,null,null,"",{"$f":"_xlfn.SWITCH(B134,\"(vide)\",\"\",ISBLANK(B134),\"\",B134)","v":0},0,0,null,null,"","","",""]
[null,null,null,null,null,"",{"$f":"_xlfn.SWITCH(B135,\"(vide)\",\"\",ISBLANK(B135),\"\",B135)","v":0},0,0,null,null,"","","",""]
[null,null,null,null,null,"",{"$f":"_xlfn.SWITCH(B136,\"(vide)\",\"\",ISBLANK(B136),\"\",B136)","v":0},0,0,null,null,"","","",""]
[null,null,null,null,null,"",{"$f":"_xlfn.SWITCH(B137,\"(vide)\",\"\",ISBLANK(B137),\"\",B137)","v":0},0,0,null,null,"","","",""]
[null,null,null,null,null,"",{"$f":"_xlfn.SWITCH(B138,\"(vide)\",\"\",ISBLANK(B138),\"\",B138)","v":0},0,0,null,null,"","","",""]
[null,null,null,null,null,"",{"$f":"_xlfn.SWITCH(B139,\"(vide)\",\"\",ISBLANK(B139),\"\",B139)","v":0},0,0,null,null,"","","",""]
[null,null,null,null,null,"",{"$f":"_xlfn.SWITCH(B140,\"(vide)\",\"\",ISBLANK(B140),\"\",B140)","v":0},0,0,null,null,"","","",""]
[null,null,null,null,null,"",{"$f":"_xlfn.SWITCH(B141,\"(vide)\",\"\",ISBLANK(B141),\"\",B141)","v":0},0,0,null,null,"","","",""]
[null,null,null,null,null,"",{"$f":"_xlfn.SWITCH(B142,\"(vide)\",\"\",ISBLANK(B142),\"\",B142)","v":0},0,0,null,null,"","","",""]

{"sheet":"HdF","index":17,"n_rows":1,"n_cols":1,"rows_kept":1,"cut":false,"hidden":false,"merged":[[0,0,2,22]]}
["REGION\nHAUTS DE FRANCE"]

{"sheet":"IDF TCD","index":18,"n_rows":142,"n_cols":15,"rows_kept":142,"cut":false,"hidden":true,"merged":[]}
["Pays","Provinces","Départements","CENTRE",null,{"$f":"A1","v":"Pays"},{"$f":"B1","v":"Provinces"},{"$f":"C1","v":"Départements"},"CENTRE",null,null,{"$f":"IF(F1=0,\"\",F1)","v":"Pays"},"Provinces","Départements","CENTRE"]
["France","Ile-de-France","Essonne","Evry Ris Orangis",null,{"$f":"IF(A2=\"\",\"\",A2)","v":"France"},{"$f":"IF(B2=\"(vide)\",\"\",B2)","v":"Ile-de-France"},"Essonne","Evry Ris Orangis",null,null,"France","Ile-de-France","Essonne","Evry Ris Orangis"]
["France","Ile-de-France","Essonne","Lardy",null,{"$f":"IF(A3=\"\",\"\",A3)","v":"France"},{"$f":"IF(B3=\"(vide)\",\"\",B3)","v":"Ile-de-France"},"Essonne","Lardy",null,null,{"$f":"IF(F3=0,\"\",F3)","v":"France"},{"$f":"IF(G3=0,\"\",G3)","v":"Ile-de-France"},{"$f":"IF(H3=0,\"\",H3)","v":"Essonne"},{"$f":"IF(I3=0,\"\",I3)","v":"Lardy"}]
["France","Ile-de-France","Hauts-de-Seine","Meudon la Forêt",null,"France","Ile-de-France","Hauts-de-Seine","Meudon la Forêt",null,null,{"$f":"IF(F4=0,\"\",F4)","v":"France"},"Ile-de-France","Hauts-de-Seine","Meudon la Forêt"]
["France","Ile-de-France","Hauts-de-Seine","Nanterre la défense",null,"France",{"$f":"_xlfn.SWITCH(B5,\"(vide)\",\"\",ISBLANK(B5),\"\",B5)","v":"Ile-de-France"},"Hauts-de-Seine","Nanterre la défense",null,null,"France","Ile-de-France","Hauts-de-Seine","Nanterre la défense"]
["France","Ile-de-France","Paris","Paris Politzer",null,"France",{"$f":"_xlfn.SWITCH(B6,\"(vide)\",\"\",ISBLANK(B6),\"\",B6)","v":"Ile-de-France"},"Paris","Paris Politzer",null,null,"France","Ile-de-France","Paris","Paris Politzer"]
["France","Ile-de-France","Seine-et-Marne","Champs sur Marne",null,"France",{"$f":"_xlfn.SWITCH(B7,\"(vide)\",\"\",ISBLANK(B7),\"\",B7)","v":"Ile-de-France"},"Seine-et-Marne","Champs sur Marne",null,null,"France","Ile-de-France","Seine-et-Marne","Champs sur Marne"]
["France","Ile-de-France","Seine-Saint-Denis","Stains",null,"France",{"$f":"_xlfn.SWITCH(B8,\"(vide)\",\"\",ISBLANK(B8),\"\",B8)","v":"Ile-de-France"},"Seine-Saint-Denis","Stains",null,null,"France","Ile-de-France","Seine-Saint-Denis","Stains"]
["France","Ile-de-France","Val-de-Marne","Créteil",null,"France",{"$f":"_xlfn.SWITCH(B9,\"(vide)\",\"\",ISBLANK(B9),\"\",B9)","v":"Ile-de-France"},"Val-de-Marne","Créteil",null,null,"France","Ile-de-France","Val-de-Marne","Créteil"]
["France","Ile-de-France","Val-D'Oise","Bernes sur Oise",null,"France",{"$f":"_xlfn.SWITCH(B10,\"(vide)\",\"\",ISBLANK(B10),\"\",B10)","v":"Ile-de-France"},"Val-D'Oise","Bernes sur Oise",null,null,"France","Ile-de-France","Val-D'Oise","Bernes sur Oise"]
["France","Ile-de-France","Val-D'Oise","Gonesse",null,"France",{"$f":"_xlfn.SWITCH(B11,\"(vide)\",\"\",ISBLANK(B11),\"\",B11)","v":"Ile-de-France"},"Val-D'Oise","Gonesse",null,null,"France","Ile-de-France","Val-D'Oise","Gonesse"]
["France","Ile-de-France","Val-D'Oise","Saint Ouen l'Aumône",null,"France",{"$f":"_xlfn.SWITCH(B12,\"(vide)\",\"\",ISBLANK(B12),\"\",B12)","v":"Ile-de-France"},"Val-D'Oise","Saint Ouen l'Aumône",null,null,"France","Ile-de-France","Val-D'Oise","Saint Ouen l'Aumône"]
["France","Ile-de-France","Yvelines","Elancourt SQY",null,"France",{"$f":"_xlfn.SWITCH(B13,\"(vide)\",\"\",ISBLANK(B13),\"\",B13)","v":"Ile-de-France"},"Yvelines","Elancourt SQY",null,null,"France","Ile-de-France","Yvelines","Elancourt SQY"]
["France","Ile-de-France","Yvelines","Mantes Magnanville",null,"France",{"$f":"_xlfn.SWITCH(B14,\"(vide)\",\"\",ISBLANK(B14),\"\",B14)","v":"Ile-de-France"},"Yvelines","Mantes Magnanville",null,null,"France","Ile-de-France","Yvelines","Mantes Magnanville"]
[null,null,null,null,null,"",{"$f":"_xlfn.SWITCH(B15,\"(vide)\",\"\",ISBLANK(B15),\"\",B15)","v":0},0,0,null,null,"","","",""]
[null,null,null,null,null,"",{"$f":"_xlfn.SWITCH(B16,\"(vide)\",\"\",ISBLANK(B16),\"\",B16)","v":0},0,0,null,null,"","","",""]
[null,null,null,null,null,"",{"$f":"_xlfn.SWITCH(B17,\"(vide)\",\"\",ISBLANK(B17),\"\",B17)","v":0},{"$f":"C17","v":0},0,null,null,"","","",""]
[null,null,null,null,null,"",{"$f":"_xlfn.SWITCH(B18,\"(vide)\",\"\",ISBLANK(B18),\"\",B18)","v":0},0,0,null,null,"","","",""]
[null,null,null,null,null,"",{"$f":"_xlfn.SWITCH(B19,\"(vide)\",\"\",ISBLANK(B19),\"\",B19)","v":0},0,0,null,null,"","","",""]
[null,null,null,null,null,"",{"$f":"_xlfn.SWITCH(B20,\"(vide)\",\"\",ISBLANK(B20),\"\",B20)","v":0},0,0,null,null,"","","",""]
[null,null,null,null,null,"",{"$f":"_xlfn.SWITCH(B21,\"(vide)\",\"\",ISBLANK(B21),\"\",B21)","v":0},0,0,null,null,"","","",""]
[null,null,null,null,null,"",{"$f":"_xlfn.SWITCH(B22,\"(vide)\",\"\",ISBLANK(B22),\"\",B22)","v":0},0,0,null,null,"","","",""]
[null,null,null,null,null,"",{"$f":"_xlfn.SWITCH(B23,\"(vide)\",\"\",ISBLANK(B23),\"\",B23)","v":0},0,0,null,null,"","","",""]
[null,null,null,null,null,"",{"$f":"_xlfn.SWITCH(B24,\"(vide)\",\"\",ISBLANK(B24),\"\",B24)","v":0},0,0,null,null,"","","",""]
[null,null,null,null,null,"",{"$f":"_xlfn.SWITCH(B25,\"(vide)\",\"\",ISBLANK(B25),\"\",B25)","v":0},0,0,null,null,"","","",""]
[null,null,null,null,null,"",{"$f":"_xlfn.SWITCH(B26,\"(vide)\",\"\",ISBLANK(B26),\"\",B26)","v":0},0,0,null,null,"","","",""]
[null,null,null,null,null,"",{"$f":"_xlfn.SWITCH(B27,\"(vide)\",\"\",ISBLANK(B27),\"\",B27)","v":0},0,0,null,null,"","","",""]
[null,null,null,null,null,"",{"$f":"_xlfn.SWITCH(B28,\"(vide)\",\"\",ISBLANK(B28),\"\",B28)","v":0},0,0,null,null,"","","",""]
[null,null,null,null,null,"",{"$f":"_xlfn.SWITCH(B29,\"(vide)\",\"\",ISBLANK(B29),\"\",B29)","v":0},0,0,null,null,"","","",""]
[null,null,null,null,null,"",{"$f":"_xlfn.SWITCH(B30,\"(vide)\",\"\",ISBLANK(B30),\"\",B30)","v":0},0,0,null,null,"","","",""]
[null,null,null,null,null,"",{"$f":"_xlfn.SWITCH(B31,\"(vide)\",\"\",ISBLANK(B31),\"\",B31)","v":0},0,0,null,null,"","","",""]
[null,null,null,null,null,"",{"$f":"_xlfn.SWITCH(B32,\"(vide)\",\"\",ISBLANK(B32),\"\",B32)","v":0},0,0,null,null,"","","",""]
[null,null,null,null,null,"",{"$f":"_xlfn.SWITCH(B33,\"(vide)\",\"\",ISBLANK(B33),\"\",B33)","v":0},0,0,null,null,"","","",""]
[null,null,null,null,null,"",{"$f":"_xlfn.SWITCH(B34,\"(vide)\",\"\",ISBLANK(B34),\"\",B34)","v":0},0,0,null,null,"","","",""]
[null,null,null,null,null,"",{"$f":"_xlfn.SWITCH(B35,\"(vide)\",\"\",ISBLANK(B35),\"\",B35)","v":0},0,0,null,null,"","","",""]
[null,null,null,null,null,"",{"$f":"_xlfn.SWITCH(B36,\"(vide)\",\"\",ISBLANK(B36),\"\",B36)","v":0},0,0,null,null,"","","",""]
[null,null,null,null,null,"",{"$f":"_xlfn.SWITCH(B37,\"(vide)\",\"\",ISBLANK(B37),\"\",B37)","v":0},0,0,null,null,"","","",""]
[null,null,null,null,null,"",{"$f":"_xlfn.SWITCH(B38,\"(vide)\",\"\",ISBLANK(B38),\"\",B38)","v":0},0,0,null,null,"","","",""]
[null,null,null,null,null,"",{"$f":"_xlfn.SWITCH(B39,\"(vide)\",\"\",ISBLANK(B39),\"\",B39)","v":0},0,0,null,null,"","","",""]
[null,null,null,null,null,"",{"$f":"_xlfn.SWITCH(B40,\"(vide)\",\"\",ISBLANK(B40),\"\",B40)","v":0},0,0,null,null,"","","",""]
[null,null,null,null,null,"",{"$f":"_xlfn.SWITCH(B41,\"(vide)\",\"\",ISBLANK(B41),\"\",B41)","v":0},0,0,null,null,"","","",""]
[null,null,null,null,null,"",{"$f":"_xlfn.SWITCH(B42,\"(vide)\",\"\",ISBLANK(B42),\"\",B42)","v":0},0,0,null,null,"","","",""]
[null,null,null,null,null,"",{"$f":"_xlfn.SWITCH(B43,\"(vide)\",\"\",ISBLANK(B43),\"\",B43)","v":0},0,0,null,null,"","","",""]
[null,null,null,null,null,"",{"$f":"_xlfn.SWITCH(B44,\"(vide)\",\"\",ISBLANK(B44),\"\",B44)","v":0},0,0,null,null,"","","",""]
[null,null,null,null,null,"",{"$f":"_xlfn.SWITCH(B45,\"(vide)\",\"\",ISBLANK(B45),\"\",B45)","v":0},0,0,null,null,"","","",""]
[null,null,null,null,null,"",{"$f":"_xlfn.SWITCH(B46,\"(vide)\",\"\",ISBLANK(B46),\"\",B46)","v":0},0,0,null,null,"","","",""]
[null,null,null,null,null,"",{"$f":"_xlfn.SWITCH(B47,\"(vide)\",\"\",ISBLANK(B47),\"\",B47)","v":0},0,0,null,null,"","","",""]
[null,null,null,null,null,"",{"$f":"_xlfn.SWITCH(B48,\"(vide)\",\"\",ISBLANK(B48),\"\",B48)","v":0},0,0,null,null,"","","",""]
[null,null,null,null,null,"",{"$f":"_xlfn.SWITCH(B49,\"(vide)\",\"\",ISBLANK(B49),\"\",B49)","v":0},0,0,null,null,"","","",""]
[null,null,null,null,null,"",{"$f":"_xlfn.SWITCH(B50,\"(vide)\",\"\",ISBLANK(B50),\"\",B50)","v":0},0,0,null,null,"","","",""]
[null,null,null,null,null,"",{"$f":"_xlfn.SWITCH(B51,\"(vide)\",\"\",ISBLANK(B51),\"\",B51)","v":0},0,0,null,null,"","","",""]
[null,null,null,null,null,"",{"$f":"_xlfn.SWITCH(B52,\"(vide)\",\"\",ISBLANK(B52),\"\",B52)","v":0},0,0,null,null,"","","",""]
[null,null,null,null,null,"",{"$f":"_xlfn.SWITCH(B53,\"(vide)\",\"\",ISBLANK(B53),\"\",B53)","v":0},0,0,null,null,"","","",""]
[null,null,null,null,null,"",{"$f":"_xlfn.SWITCH(B54,\"(vide)\",\"\",ISBLANK(B54),\"\",B54)","v":0},0,0,null,null,"","","",""]
[null,null,null,null,null,"",{"$f":"_xlfn.SWITCH(B55,\"(vide)\",\"\",ISBLANK(B55),\"\",B55)","v":0},0,0,null,null,"","","",""]
[null,null,null,null,null,"",{"$f":"_xlfn.SWITCH(B56,\"(vide)\",\"\",ISBLANK(B56),\"\",B56)","v":0},0,0,null,null,"","","",""]
[null,null,null,null,null,"",{"$f":"_xlfn.SWITCH(B57,\"(vide)\",\"\",ISBLANK(B57),\"\",B57)","v":0},0,0,null,null,"","","",""]
[null,null,null,null,null,"",{"$f":"_xlfn.SWITCH(B58,\"(vide)\",\"\",ISBLANK(B58),\"\",B58)","v":0},0,0,null,null,"","","",""]
[null,null,null,null,null,"",{"$f":"_xlfn.SWITCH(B59,\"(vide)\",\"\",ISBLANK(B59),\"\",B59)","v":0},0,0,null,null,"","","",""]
[null,null,null,null,null,"",{"$f":"_xlfn.SWITCH(B60,\"(vide)\",\"\",ISBLANK(B60),\"\",B60)","v":0},0,0,null,null,"","","",""]
[null,null,null,null,null,"",{"$f":"_xlfn.SWITCH(B61,\"(vide)\",\"\",ISBLANK(B61),\"\",B61)","v":0},0,0,null,null,"","","",""]
[null,null,null,null,null,"",{"$f":"_xlfn.SWITCH(B62,\"(vide)\",\"\",ISBLANK(B62),\"\",B62)","v":0},0,0,null,null,"","","",""]
[null,null,null,null,null,"",{"$f":"_xlfn.SWITCH(B63,\"(vide)\",\"\",ISBLANK(B63),\"\",B63)","v":0},0,0,null,null,"","","",""]
[null,null,null,null,null,"",{"$f":"_xlfn.SWITCH(B64,\"(vide)\",\"\",ISBLANK(B64),\"\",B64)","v":0},0,0,null,null,"","","",""]
[null,null,null,null,null,"",{"$f":"_xlfn.SWITCH(B65,\"(vide)\",\"\",ISBLANK(B65),\"\",B65)","v":0},0,0,null,null,"","","",""]
[null,null,null,null,null,"",{"$f":"_xlfn.SWITCH(B66,\"(vide)\",\"\",ISBLANK(B66),\"\",B66)","v":0},0,0,null,null,"","","",""]
[null,null,null,null,null,{"$f":"IF(A67=\"\",\"\",A67)","v":""},{"$f":"_xlfn.SWITCH(B67,\"(vide)\",\"\",ISBLANK(B67),\"\",B67)","v":0},0,0,null,null,"","","",{"$f":"IF(I67=0,\"\",I67)","v":""}]
[null,null,null,null,null,"",{"$f":"_xlfn.SWITCH(B68,\"(vide)\",\"\",ISBLANK(B68),\"\",B68)","v":0},0,0,null,null,{"$f":"IF(F68=0,\"\",F68)","v":""},"","",""]
[null,null,null,null,null,"",{"$f":"_xlfn.SWITCH(B69,\"(vide)\",\"\",ISBLANK(B69),\"\",B69)","v":0},0,0,null,null,"","","",""]
[null,null,null,null,null,"",{"$f":"_xlfn.SWITCH(B70,\"(vide)\",\"\",ISBLANK(B70),\"\",B70)","v":0},0,0,null,null,"","","",""]
[null,null,null,null,null,"",{"$f":"_xlfn.SWITCH(B71,\"(vide)\",\"\",ISBLANK(B71),\"\",B71)","v":0},0,0,null,null,"","","",""]
[null,null,null,null,null,"",{"$f":"_xlfn.SWITCH(B72,\"(vide)\",\"\",ISBLANK(B72),\"\",B72)","v":0},0,0,null,null,"","","",""]
[null,null,null,null,null,"",{"$f":"_xlfn.SWITCH(B73,\"(vide)\",\"\",ISBLANK(B73),\"\",B73)","v":0},0,0,null,null,"","","",""]
[null,null,null,null,null,"",{"$f":"_xlfn.SWITCH(B74,\"(vide)\",\"\",ISBLANK(B74),\"\",B74)","v":0},0,0,null,null,"","","",""]
[null,null,null,null,null,"",{"$f":"_xlfn.SWITCH(B75,\"(vide)\",\"\",ISBLANK(B75),\"\",B75)","v":0},0,0,null,null,"","","",""]
[null,null,null,null,null,"",{"$f":"_xlfn.SWITCH(B76,\"(vide)\",\"\",ISBLANK(B76),\"\",B76)","v":0},0,0,null,null,"","","",""]
[null,null,null,null,null,"",{"$f":"_xlfn.SWITCH(B77,\"(vide)\",\"\",ISBLANK(B77),\"\",B77)","v":0},0,0,null,null,"","","",""]
[null,null,null,null,null,"",{"$f":"_xlfn.SWITCH(B78,\"(vide)\",\"\",ISBLANK(B78),\"\",B78)","v":0},0,0,null,null,"","","",""]
[null,null,null,null,null,"",{"$f":"_xlfn.SWITCH(B79,\"(vide)\",\"\",ISBLANK(B79),\"\",B79)","v":0},0,0,null,null,"","","",""]
[null,null,null,null,null,"",{"$f":"_xlfn.SWITCH(B80,\"(vide)\",\"\",ISBLANK(B80),\"\",B80)","v":0},0,0,null,null,"","","",""]
[null,null,null,null,null,"",{"$f":"_xlfn.SWITCH(B81,\"(vide)\",\"\",ISBLANK(B81),\"\",B81)","v":0},{"$f":"C81","v":0},0,null,null,"","","",""]
[null,null,null,null,null,"",{"$f":"_xlfn.SWITCH(B82,\"(vide)\",\"\",ISBLANK(B82),\"\",B82)","v":0},0,0,null,null,"","","",""]
[null,null,null,null,null,"",{"$f":"_xlfn.SWITCH(B83,\"(vide)\",\"\",ISBLANK(B83),\"\",B83)","v":0},0,0,null,null,"","","",""]
[null,null,null,null,null,"",{"$f":"_xlfn.SWITCH(B84,\"(vide)\",\"\",ISBLANK(B84),\"\",B84)","v":0},0,0,null,null,"","","",""]
[null,null,null,null,null,"",{"$f":"_xlfn.SWITCH(B85,\"(vide)\",\"\",ISBLANK(B85),\"\",B85)","v":0},0,0,null,null,"","","",""]
[null,null,null,null,null,"",{"$f":"_xlfn.SWITCH(B86,\"(vide)\",\"\",ISBLANK(B86),\"\",B86)","v":0},0,0,null,null,"","","",""]
[null,null,null,null,null,"",{"$f":"_xlfn.SWITCH(B87,\"(vide)\",\"\",ISBLANK(B87),\"\",B87)","v":0},0,0,null,null,"","","",""]
[null,null,null,null,null,"",{"$f":"_xlfn.SWITCH(B88,\"(vide)\",\"\",ISBLANK(B88),\"\",B88)","v":0},0,0,null,null,"","","",""]
[null,null,null,null,null,"",{"$f":"_xlfn.SWITCH(B89,\"(vide)\",\"\",ISBLANK(B89),\"\",B89)","v":0},0,0,null,null,"","","",""]
[null,null,null,null,null,"",{"$f":"_xlfn.SWITCH(B90,\"(vide)\",\"\",ISBLANK(B90),\"\",B90)","v":0},0,0,null,null,"","","",""]
[null,null,null,null,null,"",{"$f":"_xlfn.SWITCH(B91,\"(vide)\",\"\",ISBLANK(B91),\"\",B91)","v":0},0,0,null,null,"","","",""]
[null,null,null,null,null,"",{"$f":"_xlfn.SWITCH(B92,\"(vide)\",\"\",ISBLANK(B92),\"\",B92)","v":0},0,0,null,null,"","","",""]
[null,null,null,null,null,"",{"$f":"_xlfn.SWITCH(B93,\"(vide)\",\"\",ISBLANK(B93),\"\",B93)","v":0},0,0,null,null,"","","",""]
[null,null,null,null,null,"",{"$f":"_xlfn.SWITCH(B94,\"(vide)\",\"\",ISBLANK(B94),\"\",B94)","v":0},0,0,null,null,"","","",""]
[null,null,null,null,null,"",{"$f":"_xlfn.SWITCH(B95,\"(vide)\",\"\",ISBLANK(B95),\"\",B95)","v":0},0,0,null,null,"","","",""]
[null,null,null,null,null,"",{"$f":"_xlfn.SWITCH(B96,\"(vide)\",\"\",ISBLANK(B96),\"\",B96)","v":0},0,0,null,null,"","","",""]
[null,null,null,null,null,"",{"$f":"_xlfn.SWITCH(B97,\"(vide)\",\"\",ISBLANK(B97),\"\",B97)","v":0},0,0,null,null,"","","",""]
[null,null,null,null,null,"",{"$f":"_xlfn.SWITCH(B98,\"(vide)\",\"\",ISBLANK(B98),\"\",B98)","v":0},0,0,null,null,"","","",""]
[null,null,null,null,null,"",{"$f":"_xlfn.SWITCH(B99,\"(vide)\",\"\",ISBLANK(B99),\"\",B99)","v":0},0,0,null,null,"","","",""]
[null,null,null,null,null,"",{"$f":"_xlfn.SWITCH(B100,\"(vide)\",\"\",ISBLANK(B100),\"\",B100)","v":0},0,0,null,null,"","","",""]
[null,null,null,null,null,"",{"$f":"_xlfn.SWITCH(B101,\"(vide)\",\"\",ISBLANK(B101),\"\",B101)","v":0},0,0,null,null,"","","",""]
[null,null,null,null,null,"",{"$f":"_xlfn.SWITCH(B102,\"(vide)\",\"\",ISBLANK(B102),\"\",B102)","v":0},0,0,null,null,"","","",""]
[null,null,null,null,null,"",{"$f":"_xlfn.SWITCH(B103,\"(vide)\",\"\",ISBLANK(B103),\"\",B103)","v":0},0,0,null,null,"","","",""]
[null,null,null,null,null,"",{"$f":"_xlfn.SWITCH(B104,\"(vide)\",\"\",ISBLANK(B104),\"\",B104)","v":0},0,0,null,null,"","","",""]
[null,null,null,null,null,"",{"$f":"_xlfn.SWITCH(B105,\"(vide)\",\"\",ISBLANK(B105),\"\",B105)","v":0},0,0,null,null,"","","",""]
[null,null,null,null,null,"",{"$f":"_xlfn.SWITCH(B106,\"(vide)\",\"\",ISBLANK(B106),\"\",B106)","v":0},0,0,null,null,"","","",""]
[null,null,null,null,null,"",{"$f":"_xlfn.SWITCH(B107,\"(vide)\",\"\",ISBLANK(B107),\"\",B107)","v":0},0,0,null,null,"","","",""]
[null,null,null,null,null,"",{"$f":"_xlfn.SWITCH(B108,\"(vide)\",\"\",ISBLANK(B108),\"\",B108)","v":0},0,0,null,null,"","","",""]
[null,null,null,null,null,"",{"$f":"_xlfn.SWITCH(B109,\"(vide)\",\"\",ISBLANK(B109),\"\",B109)","v":0},0,0,null,null,"","","",""]
[null,null,null,null,null,"",{"$f":"_xlfn.SWITCH(B110,\"(vide)\",\"\",ISBLANK(B110),\"\",B110)","v":0},0,0,null,null,"","","",""]
[null,null,null,null,null,"",{"$f":"_xlfn.SWITCH(B111,\"(vide)\",\"\",ISBLANK(B111),\"\",B111)","v":0},0,0,null,null,"","","",""]
[null,null,null,null,null,"",{"$f":"_xlfn.SWITCH(B112,\"(vide)\",\"\",ISBLANK(B112),\"\",B112)","v":0},0,0,null,null,"","","",""]
[null,null,null,null,null,"",{"$f":"_xlfn.SWITCH(B113,\"(vide)\",\"\",ISBLANK(B113),\"\",B113)","v":0},0,0,null,null,"","","",""]
[null,null,null,null,null,"",{"$f":"_xlfn.SWITCH(B114,\"(vide)\",\"\",ISBLANK(B114),\"\",B114)","v":0},0,0,null,null,"","","",""]
[null,null,null,null,null,"",{"$f":"_xlfn.SWITCH(B115,\"(vide)\",\"\",ISBLANK(B115),\"\",B115)","v":0},0,0,null,null,"","","",""]
[null,null,null,null,null,"",{"$f":"_xlfn.SWITCH(B116,\"(vide)\",\"\",ISBLANK(B116),\"\",B116)","v":0},0,0,null,null,"","","",""]
[null,null,null,null,null,"",{"$f":"_xlfn.SWITCH(B117,\"(vide)\",\"\",ISBLANK(B117),\"\",B117)","v":0},0,0,null,null,"","","",""]
[null,null,null,null,null,"",{"$f":"_xlfn.SWITCH(B118,\"(vide)\",\"\",ISBLANK(B118),\"\",B118)","v":0},0,0,null,null,"","","",""]
[null,null,null,null,null,"",{"$f":"_xlfn.SWITCH(B119,\"(vide)\",\"\",ISBLANK(B119),\"\",B119)","v":0},0,0,null,null,"","","",""]
[null,null,null,null,null,"",{"$f":"_xlfn.SWITCH(B120,\"(vide)\",\"\",ISBLANK(B120),\"\",B120)","v":0},0,0,null,null,"","","",""]
[null,null,null,null,null,"",{"$f":"_xlfn.SWITCH(B121,\"(vide)\",\"\",ISBLANK(B121),\"\",B121)","v":0},0,0,null,null,"","","",""]
[null,null,null,null,null,"",{"$f":"_xlfn.SWITCH(B122,\"(vide)\",\"\",ISBLANK(B122),\"\",B122)","v":0},0,0,null,null,"","","",""]
[null,null,null,null,null,"",{"$f":"_xlfn.SWITCH(B123,\"(vide)\",\"\",ISBLANK(B123),\"\",B123)","v":0},0,0,null,null,"","","",""]
[null,null,null,null,null,"",{"$f":"_xlfn.SWITCH(B124,\"(vide)\",\"\",ISBLANK(B124),\"\",B124)","v":0},0,0,null,null,"","","",""]
[null,null,null,null,null,"",{"$f":"_xlfn.SWITCH(B125,\"(vide)\",\"\",ISBLANK(B125),\"\",B125)","v":0},0,0,null,null,"","","",""]
[null,null,null,null,null,"",{"$f":"_xlfn.SWITCH(B126,\"(vide)\",\"\",ISBLANK(B126),\"\",B126)","v":0},0,0,null,null,"","","",""]
[null,null,null,null,null,"",{"$f":"_xlfn.SWITCH(B127,\"(vide)\",\"\",ISBLANK(B127),\"\",B127)","v":0},0,0,null,null,"","","",""]
[null,null,null,null,null,"",{"$f":"_xlfn.SWITCH(B128,\"(vide)\",\"\",ISBLANK(B128),\"\",B128)","v":0},0,0,null,null,"","","",""]
[null,null,null,null,null,"",{"$f":"_xlfn.SWITCH(B129,\"(vide)\",\"\",ISBLANK(B129),\"\",B129)","v":0},0,0,null,null,"","","",""]
[null,null,null,null,null,"",{"$f":"_xlfn.SWITCH(B130,\"(vide)\",\"\",ISBLANK(B130),\"\",B130)","v":0},0,0,null,null,"","","",""]
[null,null,null,null,null,{"$f":"IF(A131=\"\",\"\",A131)","v":""},{"$f":"_xlfn.SWITCH(B131,\"(vide)\",\"\",ISBLANK(B131),\"\",B131)","v":0},0,0,null,null,"","","",""]
[null,null,null,null,null,"",{"$f":"_xlfn.SWITCH(B132,\"(vide)\",\"\",ISBLANK(B132),\"\",B132)","v":0},0,0,null,null,{"$f":"IF(F132=0,\"\",F132)","v":""},"","",""]
[null,null,null,null,null,"",{"$f":"_xlfn.SWITCH(B133,\"(vide)\",\"\",ISBLANK(B133),\"\",B133)","v":0},0,0,null,null,"","","",""]
[null,null,null,null,null,"",{"$f":"_xlfn.SWITCH(B134,\"(vide)\",\"\",ISBLANK(B134),\"\",B134)","v":0},0,0,null,null,"","","",""]
[null,null,null,null,null,"",{"$f":"_xlfn.SWITCH(B135,\"(vide)\",\"\",ISBLANK(B135),\"\",B135)","v":0},0,0,null,null,"","","",""]
[null,null,null,null,null,"",{"$f":"_xlfn.SWITCH(B136,\"(vide)\",\"\",ISBLANK(B136),\"\",B136)","v":0},0,0,null,null,"","","",""]
[null,null,null,null,null,"",{"$f":"_xlfn.SWITCH(B137,\"(vide)\",\"\",ISBLANK(B137),\"\",B137)","v":0},0,0,null,null,"","","",""]
[null,null,null,null,null,"",{"$f":"_xlfn.SWITCH(B138,\"(vide)\",\"\",ISBLANK(B138),\"\",B138)","v":0},0,0,null,null,"","","",""]
[null,null,null,null,null,"",{"$f":"_xlfn.SWITCH(B139,\"(vide)\",\"\",ISBLANK(B139),\"\",B139)","v":0},0,0,null,null,"","","",""]
[null,null,null,null,null,"",{"$f":"_xlfn.SWITCH(B140,\"(vide)\",\"\",ISBLANK(B140),\"\",B140)","v":0},0,0,null,null,"","","",""]
[null,null,null,null,null,"",{"$f":"_xlfn.SWITCH(B141,\"(vide)\",\"\",ISBLANK(B141),\"\",B141)","v":0},0,0,null,null,"","","",""]
[null,null,null,null,null,"",{"$f":"_xlfn.SWITCH(B142,\"(vide)\",\"\",ISBLANK(B142),\"\",B142)","v":0},0,0,null,null,"","","",""]

{"sheet":"IdF","index":19,"n_rows":1,"n_cols":1,"rows_kept":1,"cut":false,"hidden":false,"merged":[[0,0,2,22]]}
["REGION\nILE DE FRANCE"]

{"sheet":"PdlL TCD","index":20,"n_rows":142,"n_cols":15,"rows_kept":142,"cut":false,"hidden":true,"merged":[]}
["Pays","Provinces","Départements","CENTRE",null,{"$f":"A1","v":"Pays"},{"$f":"B1","v":"Provinces"},{"$f":"C1","v":"Départements"},"CENTRE",null,null,{"$f":"IF(F1=0,\"\",F1)","v":"Pays"},"Provinces","Départements","CENTRE"]
["France","Pays de la Loire","Maine-et-Loire","Angers",null,{"$f":"IF(A2=\"\",\"\",A2)","v":"France"},{"$f":"IF(B2=\"(vide)\",\"\",B2)","v":"Pays de la Loire"},"Maine-et-Loire","Angers",null,null,"France","Pays de la Loire","Maine-et-Loire","Angers"]
["France","Pays de la Loire","Maine-et-Loire","Cholet",null,{"$f":"IF(A3=\"\",\"\",A3)","v":"France"},{"$f":"IF(B3=\"(vide)\",\"\",B3)","v":"Pays de la Loire"},"Maine-et-Loire","Cholet",null,null,{"$f":"IF(F3=0,\"\",F3)","v":"France"},{"$f":"IF(G3=0,\"\",G3)","v":"Pays de la Loire"},{"$f":"IF(H3=0,\"\",H3)","v":"Maine-et-Loire"},{"$f":"IF(I3=0,\"\",I3)","v":"Cholet"}]
["France","Pays de la Loire","Maine-et-Loire","Doué la Fontaine",null,"France","Pays de la Loire","Maine-et-Loire","Doué la Fontaine",null,null,{"$f":"IF(F4=0,\"\",F4)","v":"France"},"Pays de la Loire","Maine-et-Loire","Doué la Fontaine"]
["France","Pays de la Loire","Sarthe","Mans",null,"France",{"$f":"_xlfn.SWITCH(B5,\"(vide)\",\"\",ISBLANK(B5),\"\",B5)","v":"Pays de la Loire"},"Sarthe","Mans",null,null,"France","Pays de la Loire","Sarthe","Mans"]
["France","Pays de la Loire","Vendée","Fontenay le Comte",null,"France",{"$f":"_xlfn.SWITCH(B6,\"(vide)\",\"\",ISBLANK(B6),\"\",B6)","v":"Pays de la Loire"},"Vendée","Fontenay le Comte",null,null,"France","Pays de la Loire","Vendée","Fontenay le Comte"]
["France","Pays de la Loire","Vendée","La Roche sur Yon",null,"France",{"$f":"_xlfn.SWITCH(B7,\"(vide)\",\"\",ISBLANK(B7),\"\",B7)","v":"Pays de la Loire"},"Vendée","La Roche sur Yon",null,null,"France","Pays de la Loire","Vendée","La Roche sur Yon"]
["France","(vide)","Loire-Atlantique","Nantes Saint Herblain",null,"France",{"$f":"_xlfn.SWITCH(B8,\"(vide)\",\"\",ISBLANK(B8),\"\",B8)","v":""},"Loire-Atlantique","Nantes Saint Herblain",null,null,"France","","Loire-Atlantique","Nantes Saint Herblain"]
["France","(vide)","Loire-Atlantique","Saint Nazaire",null,"France",{"$f":"_xlfn.SWITCH(B9,\"(vide)\",\"\",ISBLANK(B9),\"\",B9)","v":""},"Loire-Atlantique","Saint Nazaire",null,null,"France","","Loire-Atlantique","Saint Nazaire"]
[null,null,null,null,null,"",{"$f":"_xlfn.SWITCH(B10,\"(vide)\",\"\",ISBLANK(B10),\"\",B10)","v":0},0,0,null,null,"","","",""]
[null,null,null,null,null,"",{"$f":"_xlfn.SWITCH(B11,\"(vide)\",\"\",ISBLANK(B11),\"\",B11)","v":0},0,0,null,null,"","","",""]
[null,null,null,null,null,"",{"$f":"_xlfn.SWITCH(B12,\"(vide)\",\"\",ISBLANK(B12),\"\",B12)","v":0},0,0,null,null,"","","",""]
[null,null,null,null,null,"",{"$f":"_xlfn.SWITCH(B13,\"(vide)\",\"\",ISBLANK(B13),\"\",B13)","v":0},0,0,null,null,"","","",""]
[null,null,null,null,null,"",{"$f":"_xlfn.SWITCH(B14,\"(vide)\",\"\",ISBLANK(B14),\"\",B14)","v":0},0,0,null,null,"","","",""]
[null,null,null,null,null,"",{"$f":"_xlfn.SWITCH(B15,\"(vide)\",\"\",ISBLANK(B15),\"\",B15)","v":0},0,0,null,null,"","","",""]
[null,null,null,null,null,"",{"$f":"_xlfn.SWITCH(B16,\"(vide)\",\"\",ISBLANK(B16),\"\",B16)","v":0},0,0,null,null,"","","",""]
[null,null,null,null,null,"",{"$f":"_xlfn.SWITCH(B17,\"(vide)\",\"\",ISBLANK(B17),\"\",B17)","v":0},{"$f":"C17","v":0},0,null,null,"","","",""]
[null,null,null,null,null,"",{"$f":"_xlfn.SWITCH(B18,\"(vide)\",\"\",ISBLANK(B18),\"\",B18)","v":0},0,0,null,null,"","","",""]
[null,null,null,null,null,"",{"$f":"_xlfn.SWITCH(B19,\"(vide)\",\"\",ISBLANK(B19),\"\",B19)","v":0},0,0,null,null,"","","",""]
[null,null,null,null,null,"",{"$f":"_xlfn.SWITCH(B20,\"(vide)\",\"\",ISBLANK(B20),\"\",B20)","v":0},0,0,null,null,"","","",""]
[null,null,null,null,null,"",{"$f":"_xlfn.SWITCH(B21,\"(vide)\",\"\",ISBLANK(B21),\"\",B21)","v":0},0,0,null,null,"","","",""]
[null,null,null,null,null,"",{"$f":"_xlfn.SWITCH(B22,\"(vide)\",\"\",ISBLANK(B22),\"\",B22)","v":0},0,0,null,null,"","","",""]
[null,null,null,null,null,"",{"$f":"_xlfn.SWITCH(B23,\"(vide)\",\"\",ISBLANK(B23),\"\",B23)","v":0},0,0,null,null,"","","",""]
[null,null,null,null,null,"",{"$f":"_xlfn.SWITCH(B24,\"(vide)\",\"\",ISBLANK(B24),\"\",B24)","v":0},0,0,null,null,"","","",""]
[null,null,null,null,null,"",{"$f":"_xlfn.SWITCH(B25,\"(vide)\",\"\",ISBLANK(B25),\"\",B25)","v":0},0,0,null,null,"","","",""]
[null,null,null,null,null,"",{"$f":"_xlfn.SWITCH(B26,\"(vide)\",\"\",ISBLANK(B26),\"\",B26)","v":0},0,0,null,null,"","","",""]
[null,null,null,null,null,"",{"$f":"_xlfn.SWITCH(B27,\"(vide)\",\"\",ISBLANK(B27),\"\",B27)","v":0},0,0,null,null,"","","",""]
[null,null,null,null,null,"",{"$f":"_xlfn.SWITCH(B28,\"(vide)\",\"\",ISBLANK(B28),\"\",B28)","v":0},0,0,null,null,"","","",""]
[null,null,null,null,null,"",{"$f":"_xlfn.SWITCH(B29,\"(vide)\",\"\",ISBLANK(B29),\"\",B29)","v":0},0,0,null,null,"","","",""]
[null,null,null,null,null,"",{"$f":"_xlfn.SWITCH(B30,\"(vide)\",\"\",ISBLANK(B30),\"\",B30)","v":0},0,0,null,null,"","","",""]
[null,null,null,null,null,"",{"$f":"_xlfn.SWITCH(B31,\"(vide)\",\"\",ISBLANK(B31),\"\",B31)","v":0},0,0,null,null,"","","",""]
[null,null,null,null,null,"",{"$f":"_xlfn.SWITCH(B32,\"(vide)\",\"\",ISBLANK(B32),\"\",B32)","v":0},0,0,null,null,"","","",""]
[null,null,null,null,null,"",{"$f":"_xlfn.SWITCH(B33,\"(vide)\",\"\",ISBLANK(B33),\"\",B33)","v":0},0,0,null,null,"","","",""]
[null,null,null,null,null,"",{"$f":"_xlfn.SWITCH(B34,\"(vide)\",\"\",ISBLANK(B34),\"\",B34)","v":0},0,0,null,null,"","","",""]
[null,null,null,null,null,"",{"$f":"_xlfn.SWITCH(B35,\"(vide)\",\"\",ISBLANK(B35),\"\",B35)","v":0},0,0,null,null,"","","",""]
[null,null,null,null,null,"",{"$f":"_xlfn.SWITCH(B36,\"(vide)\",\"\",ISBLANK(B36),\"\",B36)","v":0},0,0,null,null,"","","",""]
[null,null,null,null,null,"",{"$f":"_xlfn.SWITCH(B37,\"(vide)\",\"\",ISBLANK(B37),\"\",B37)","v":0},0,0,null,null,"","","",""]
[null,null,null,null,null,"",{"$f":"_xlfn.SWITCH(B38,\"(vide)\",\"\",ISBLANK(B38),\"\",B38)","v":0},0,0,null,null,"","","",""]
[null,null,null,null,null,"",{"$f":"_xlfn.SWITCH(B39,\"(vide)\",\"\",ISBLANK(B39),\"\",B39)","v":0},0,0,null,null,"","","",""]
[null,null,null,null,null,"",{"$f":"_xlfn.SWITCH(B40,\"(vide)\",\"\",ISBLANK(B40),\"\",B40)","v":0},0,0,null,null,"","","",""]
[null,null,null,null,null,"",{"$f":"_xlfn.SWITCH(B41,\"(vide)\",\"\",ISBLANK(B41),\"\",B41)","v":0},0,0,null,null,"","","",""]
[null,null,null,null,null,"",{"$f":"_xlfn.SWITCH(B42,\"(vide)\",\"\",ISBLANK(B42),\"\",B42)","v":0},0,0,null,null,"","","",""]
[null,null,null,null,null,"",{"$f":"_xlfn.SWITCH(B43,\"(vide)\",\"\",ISBLANK(B43),\"\",B43)","v":0},0,0,null,null,"","","",""]
[null,null,null,null,null,"",{"$f":"_xlfn.SWITCH(B44,\"(vide)\",\"\",ISBLANK(B44),\"\",B44)","v":0},0,0,null,null,"","","",""]
[null,null,null,null,null,"",{"$f":"_xlfn.SWITCH(B45,\"(vide)\",\"\",ISBLANK(B45),\"\",B45)","v":0},0,0,null,null,"","","",""]
[null,null,null,null,null,"",{"$f":"_xlfn.SWITCH(B46,\"(vide)\",\"\",ISBLANK(B46),\"\",B46)","v":0},0,0,null,null,"","","",""]
[null,null,null,null,null,"",{"$f":"_xlfn.SWITCH(B47,\"(vide)\",\"\",ISBLANK(B47),\"\",B47)","v":0},0,0,null,null,"","","",""]
[null,null,null,null,null,"",{"$f":"_xlfn.SWITCH(B48,\"(vide)\",\"\",ISBLANK(B48),\"\",B48)","v":0},0,0,null,null,"","","",""]
[null,null,null,null,null,"",{"$f":"_xlfn.SWITCH(B49,\"(vide)\",\"\",ISBLANK(B49),\"\",B49)","v":0},0,0,null,null,"","","",""]
[null,null,null,null,null,"",{"$f":"_xlfn.SWITCH(B50,\"(vide)\",\"\",ISBLANK(B50),\"\",B50)","v":0},0,0,null,null,"","","",""]
[null,null,null,null,null,"",{"$f":"_xlfn.SWITCH(B51,\"(vide)\",\"\",ISBLANK(B51),\"\",B51)","v":0},0,0,null,null,"","","",""]
[null,null,null,null,null,"",{"$f":"_xlfn.SWITCH(B52,\"(vide)\",\"\",ISBLANK(B52),\"\",B52)","v":0},0,0,null,null,"","","",""]
[null,null,null,null,null,"",{"$f":"_xlfn.SWITCH(B53,\"(vide)\",\"\",ISBLANK(B53),\"\",B53)","v":0},0,0,null,null,"","","",""]
[null,null,null,null,null,"",{"$f":"_xlfn.SWITCH(B54,\"(vide)\",\"\",ISBLANK(B54),\"\",B54)","v":0},0,0,null,null,"","","",""]
[null,null,null,null,null,"",{"$f":"_xlfn.SWITCH(B55,\"(vide)\",\"\",ISBLANK(B55),\"\",B55)","v":0},0,0,null,null,"","","",""]
[null,null,null,null,null,"",{"$f":"_xlfn.SWITCH(B56,\"(vide)\",\"\",ISBLANK(B56),\"\",B56)","v":0},0,0,null,null,"","","",""]
[null,null,null,null,null,"",{"$f":"_xlfn.SWITCH(B57,\"(vide)\",\"\",ISBLANK(B57),\"\",B57)","v":0},0,0,null,null,"","","",""]
[null,null,null,null,null,"",{"$f":"_xlfn.SWITCH(B58,\"(vide)\",\"\",ISBLANK(B58),\"\",B58)","v":0},0,0,null,null,"","","",""]
[null,null,null,null,null,"",{"$f":"_xlfn.SWITCH(B59,\"(vide)\",\"\",ISBLANK(B59),\"\",B59)","v":0},0,0,null,null,"","","",""]
[null,null,null,null,null,"",{"$f":"_xlfn.SWITCH(B60,\"(vide)\",\"\",ISBLANK(B60),\"\",B60)","v":0},0,0,null,null,"","","",""]
[null,null,null,null,null,"",{"$f":"_xlfn.SWITCH(B61,\"(vide)\",\"\",ISBLANK(B61),\"\",B61)","v":0},0,0,null,null,"","","",""]
[null,null,null,null,null,"",{"$f":"_xlfn.SWITCH(B62,\"(vide)\",\"\",ISBLANK(B62),\"\",B62)","v":0},0,0,null,null,"","","",""]
[null,null,null,null,null,"",{"$f":"_xlfn.SWITCH(B63,\"(vide)\",\"\",ISBLANK(B63),\"\",B63)","v":0},0,0,null,null,"","","",""]
[null,null,null,null,null,"",{"$f":"_xlfn.SWITCH(B64,\"(vide)\",\"\",ISBLANK(B64),\"\",B64)","v":0},0,0,null,null,"","","",""]
[null,null,null,null,null,"",{"$f":"_xlfn.SWITCH(B65,\"(vide)\",\"\",ISBLANK(B65),\"\",B65)","v":0},0,0,null,null,"","","",""]
[null,null,null,null,null,"",{"$f":"_xlfn.SWITCH(B66,\"(vide)\",\"\",ISBLANK(B66),\"\",B66)","v":0},0,0,null,null,"","","",""]
[null,null,null,null,null,{"$f":"IF(A67=\"\",\"\",A67)","v":""},{"$f":"_xlfn.SWITCH(B67,\"(vide)\",\"\",ISBLANK(B67),\"\",B67)","v":0},0,0,null,null,"","","",{"$f":"IF(I67=0,\"\",I67)","v":""}]
[null,null,null,null,null,"",{"$f":"_xlfn.SWITCH(B68,\"(vide)\",\"\",ISBLANK(B68),\"\",B68)","v":0},0,0,null,null,{"$f":"IF(F68=0,\"\",F68)","v":""},"","",""]
[null,null,null,null,null,"",{"$f":"_xlfn.SWITCH(B69,\"(vide)\",\"\",ISBLANK(B69),\"\",B69)","v":0},0,0,null,null,"","","",""]
[null,null,null,null,null,"",{"$f":"_xlfn.SWITCH(B70,\"(vide)\",\"\",ISBLANK(B70),\"\",B70)","v":0},0,0,null,null,"","","",""]
[null,null,null,null,null,"",{"$f":"_xlfn.SWITCH(B71,\"(vide)\",\"\",ISBLANK(B71),\"\",B71)","v":0},0,0,null,null,"","","",""]
[null,null,null,null,null,"",{"$f":"_xlfn.SWITCH(B72,\"(vide)\",\"\",ISBLANK(B72),\"\",B72)","v":0},0,0,null,null,"","","",""]
[null,null,null,null,null,"",{"$f":"_xlfn.SWITCH(B73,\"(vide)\",\"\",ISBLANK(B73),\"\",B73)","v":0},0,0,null,null,"","","",""]
[null,null,null,null,null,"",{"$f":"_xlfn.SWITCH(B74,\"(vide)\",\"\",ISBLANK(B74),\"\",B74)","v":0},0,0,null,null,"","","",""]
[null,null,null,null,null,"",{"$f":"_xlfn.SWITCH(B75,\"(vide)\",\"\",ISBLANK(B75),\"\",B75)","v":0},0,0,null,null,"","","",""]
[null,null,null,null,null,"",{"$f":"_xlfn.SWITCH(B76,\"(vide)\",\"\",ISBLANK(B76),\"\",B76)","v":0},0,0,null,null,"","","",""]
[null,null,null,null,null,"",{"$f":"_xlfn.SWITCH(B77,\"(vide)\",\"\",ISBLANK(B77),\"\",B77)","v":0},0,0,null,null,"","","",""]
[null,null,null,null,null,"",{"$f":"_xlfn.SWITCH(B78,\"(vide)\",\"\",ISBLANK(B78),\"\",B78)","v":0},0,0,null,null,"","","",""]
[null,null,null,null,null,"",{"$f":"_xlfn.SWITCH(B79,\"(vide)\",\"\",ISBLANK(B79),\"\",B79)","v":0},0,0,null,null,"","","",""]
[null,null,null,null,null,"",{"$f":"_xlfn.SWITCH(B80,\"(vide)\",\"\",ISBLANK(B80),\"\",B80)","v":0},0,0,null,null,"","","",""]
[null,null,null,null,null,"",{"$f":"_xlfn.SWITCH(B81,\"(vide)\",\"\",ISBLANK(B81),\"\",B81)","v":0},{"$f":"C81","v":0},0,null,null,"","","",""]
[null,null,null,null,null,"",{"$f":"_xlfn.SWITCH(B82,\"(vide)\",\"\",ISBLANK(B82),\"\",B82)","v":0},0,0,null,null,"","","",""]
[null,null,null,null,null,"",{"$f":"_xlfn.SWITCH(B83,\"(vide)\",\"\",ISBLANK(B83),\"\",B83)","v":0},0,0,null,null,"","","",""]
[null,null,null,null,null,"",{"$f":"_xlfn.SWITCH(B84,\"(vide)\",\"\",ISBLANK(B84),\"\",B84)","v":0},0,0,null,null,"","","",""]
[null,null,null,null,null,"",{"$f":"_xlfn.SWITCH(B85,\"(vide)\",\"\",ISBLANK(B85),\"\",B85)","v":0},0,0,null,null,"","","",""]
[null,null,null,null,null,"",{"$f":"_xlfn.SWITCH(B86,\"(vide)\",\"\",ISBLANK(B86),\"\",B86)","v":0},0,0,null,null,"","","",""]
[null,null,null,null,null,"",{"$f":"_xlfn.SWITCH(B87,\"(vide)\",\"\",ISBLANK(B87),\"\",B87)","v":0},0,0,null,null,"","","",""]
[null,null,null,null,null,"",{"$f":"_xlfn.SWITCH(B88,\"(vide)\",\"\",ISBLANK(B88),\"\",B88)","v":0},0,0,null,null,"","","",""]
[null,null,null,null,null,"",{"$f":"_xlfn.SWITCH(B89,\"(vide)\",\"\",ISBLANK(B89),\"\",B89)","v":0},0,0,null,null,"","","",""]
[null,null,null,null,null,"",{"$f":"_xlfn.SWITCH(B90,\"(vide)\",\"\",ISBLANK(B90),\"\",B90)","v":0},0,0,null,null,"","","",""]
[null,null,null,null,null,"",{"$f":"_xlfn.SWITCH(B91,\"(vide)\",\"\",ISBLANK(B91),\"\",B91)","v":0},0,0,null,null,"","","",""]
[null,null,null,null,null,"",{"$f":"_xlfn.SWITCH(B92,\"(vide)\",\"\",ISBLANK(B92),\"\",B92)","v":0},0,0,null,null,"","","",""]
[null,null,null,null,null,"",{"$f":"_xlfn.SWITCH(B93,\"(vide)\",\"\",ISBLANK(B93),\"\",B93)","v":0},0,0,null,null,"","","",""]
[null,null,null,null,null,"",{"$f":"_xlfn.SWITCH(B94,\"(vide)\",\"\",ISBLANK(B94),\"\",B94)","v":0},0,0,null,null,"","","",""]
[null,null,null,null,null,"",{"$f":"_xlfn.SWITCH(B95,\"(vide)\",\"\",ISBLANK(B95),\"\",B95)","v":0},0,0,null,null,"","","",""]
[null,null,null,null,null,"",{"$f":"_xlfn.SWITCH(B96,\"(vide)\",\"\",ISBLANK(B96),\"\",B96)","v":0},0,0,null,null,"","","",""]
[null,null,null,null,null,"",{"$f":"_xlfn.SWITCH(B97,\"(vide)\",\"\",ISBLANK(B97),\"\",B97)","v":0},0,0,null,null,"","","",""]
[null,null,null,null,null,"",{"$f":"_xlfn.SWITCH(B98,\"(vide)\",\"\",ISBLANK(B98),\"\",B98)","v":0},0,0,null,null,"","","",""]
[null,null,null,null,null,"",{"$f":"_xlfn.SWITCH(B99,\"(vide)\",\"\",ISBLANK(B99),\"\",B99)","v":0},0,0,null,null,"","","",""]
[null,null,null,null,null,"",{"$f":"_xlfn.SWITCH(B100,\"(vide)\",\"\",ISBLANK(B100),\"\",B100)","v":0},0,0,null,null,"","","",""]
[null,null,null,null,null,"",{"$f":"_xlfn.SWITCH(B101,\"(vide)\",\"\",ISBLANK(B101),\"\",B101)","v":0},0,0,null,null,"","","",""]
[null,null,null,null,null,"",{"$f":"_xlfn.SWITCH(B102,\"(vide)\",\"\",ISBLANK(B102),\"\",B102)","v":0},0,0,null,null,"","","",""]
[null,null,null,null,null,"",{"$f":"_xlfn.SWITCH(B103,\"(vide)\",\"\",ISBLANK(B103),\"\",B103)","v":0},0,0,null,null,"","","",""]
[null,null,null,null,null,"",{"$f":"_xlfn.SWITCH(B104,\"(vide)\",\"\",ISBLANK(B104),\"\",B104)","v":0},0,0,null,null,"","","",""]
[null,null,null,null,null,"",{"$f":"_xlfn.SWITCH(B105,\"(vide)\",\"\",ISBLANK(B105),\"\",B105)","v":0},0,0,null,null,"","","",""]
[null,null,null,null,null,"",{"$f":"_xlfn.SWITCH(B106,\"(vide)\",\"\",ISBLANK(B106),\"\",B106)","v":0},0,0,null,null,"","","",""]
[null,null,null,null,null,"",{"$f":"_xlfn.SWITCH(B107,\"(vide)\",\"\",ISBLANK(B107),\"\",B107)","v":0},0,0,null,null,"","","",""]
[null,null,null,null,null,"",{"$f":"_xlfn.SWITCH(B108,\"(vide)\",\"\",ISBLANK(B108),\"\",B108)","v":0},0,0,null,null,"","","",""]
[null,null,null,null,null,"",{"$f":"_xlfn.SWITCH(B109,\"(vide)\",\"\",ISBLANK(B109),\"\",B109)","v":0},0,0,null,null,"","","",""]
[null,null,null,null,null,"",{"$f":"_xlfn.SWITCH(B110,\"(vide)\",\"\",ISBLANK(B110),\"\",B110)","v":0},0,0,null,null,"","","",""]
[null,null,null,null,null,"",{"$f":"_xlfn.SWITCH(B111,\"(vide)\",\"\",ISBLANK(B111),\"\",B111)","v":0},0,0,null,null,"","","",""]
[null,null,null,null,null,"",{"$f":"_xlfn.SWITCH(B112,\"(vide)\",\"\",ISBLANK(B112),\"\",B112)","v":0},0,0,null,null,"","","",""]
[null,null,null,null,null,"",{"$f":"_xlfn.SWITCH(B113,\"(vide)\",\"\",ISBLANK(B113),\"\",B113)","v":0},0,0,null,null,"","","",""]
[null,null,null,null,null,"",{"$f":"_xlfn.SWITCH(B114,\"(vide)\",\"\",ISBLANK(B114),\"\",B114)","v":0},0,0,null,null,"","","",""]
[null,null,null,null,null,"",{"$f":"_xlfn.SWITCH(B115,\"(vide)\",\"\",ISBLANK(B115),\"\",B115)","v":0},0,0,null,null,"","","",""]
[null,null,null,null,null,"",{"$f":"_xlfn.SWITCH(B116,\"(vide)\",\"\",ISBLANK(B116),\"\",B116)","v":0},0,0,null,null,"","","",""]
[null,null,null,null,null,"",{"$f":"_xlfn.SWITCH(B117,\"(vide)\",\"\",ISBLANK(B117),\"\",B117)","v":0},0,0,null,null,"","","",""]
[null,null,null,null,null,"",{"$f":"_xlfn.SWITCH(B118,\"(vide)\",\"\",ISBLANK(B118),\"\",B118)","v":0},0,0,null,null,"","","",""]
[null,null,null,null,null,"",{"$f":"_xlfn.SWITCH(B119,\"(vide)\",\"\",ISBLANK(B119),\"\",B119)","v":0},0,0,null,null,"","","",""]
[null,null,null,null,null,"",{"$f":"_xlfn.SWITCH(B120,\"(vide)\",\"\",ISBLANK(B120),\"\",B120)","v":0},0,0,null,null,"","","",""]
[null,null,null,null,null,"",{"$f":"_xlfn.SWITCH(B121,\"(vide)\",\"\",ISBLANK(B121),\"\",B121)","v":0},0,0,null,null,"","","",""]
[null,null,null,null,null,"",{"$f":"_xlfn.SWITCH(B122,\"(vide)\",\"\",ISBLANK(B122),\"\",B122)","v":0},0,0,null,null,"","","",""]
[null,null,null,null,null,"",{"$f":"_xlfn.SWITCH(B123,\"(vide)\",\"\",ISBLANK(B123),\"\",B123)","v":0},0,0,null,null,"","","",""]
[null,null,null,null,null,"",{"$f":"_xlfn.SWITCH(B124,\"(vide)\",\"\",ISBLANK(B124),\"\",B124)","v":0},0,0,null,null,"","","",""]
[null,null,null,null,null,"",{"$f":"_xlfn.SWITCH(B125,\"(vide)\",\"\",ISBLANK(B125),\"\",B125)","v":0},0,0,null,null,"","","",""]
[null,null,null,null,null,"",{"$f":"_xlfn.SWITCH(B126,\"(vide)\",\"\",ISBLANK(B126),\"\",B126)","v":0},0,0,null,null,"","","",""]
[null,null,null,null,null,"",{"$f":"_xlfn.SWITCH(B127,\"(vide)\",\"\",ISBLANK(B127),\"\",B127)","v":0},0,0,null,null,"","","",""]
[null,null,null,null,null,"",{"$f":"_xlfn.SWITCH(B128,\"(vide)\",\"\",ISBLANK(B128),\"\",B128)","v":0},0,0,null,null,"","","",""]
[null,null,null,null,null,"",{"$f":"_xlfn.SWITCH(B129,\"(vide)\",\"\",ISBLANK(B129),\"\",B129)","v":0},0,0,null,null,"","","",""]
[null,null,null,null,null,"",{"$f":"_xlfn.SWITCH(B130,\"(vide)\",\"\",ISBLANK(B130),\"\",B130)","v":0},0,0,null,null,"","","",""]
[null,null,null,null,null,{"$f":"IF(A131=\"\",\"\",A131)","v":""},{"$f":"_xlfn.SWITCH(B131,\"(vide)\",\"\",ISBLANK(B131),\"\",B131)","v":0},0,0,null,null,"","","",""]
[null,null,null,null,null,"",{"$f":"_xlfn.SWITCH(B132,\"(vide)\",\"\",ISBLANK(B132),\"\",B132)","v":0},0,0,null,null,{"$f":"IF(F132=0,\"\",F132)","v":""},"","",""]
[null,null,null,null,null,"",{"$f":"_xlfn.SWITCH(B133,\"(vide)\",\"\",ISBLANK(B133),\"\",B133)","v":0},0,0,null,null,"","","",""]
[null,null,null,null,null,"",{"$f":"_xlfn.SWITCH(B134,\"(vide)\",\"\",ISBLANK(B134),\"\",B134)","v":0},0,0,null,null,"","","",""]
[null,null,null,null,null,"",{"$f":"_xlfn.SWITCH(B135,\"(vide)\",\"\",ISBLANK(B135),\"\",B135)","v":0},0,0,null,null,"","","",""]
[null,null,null,null,null,"",{"$f":"_xlfn.SWITCH(B136,\"(vide)\",\"\",ISBLANK(B136),\"\",B136)","v":0},0,0,null,null,"","","",""]
[null,null,null,null,null,"",{"$f":"_xlfn.SWITCH(B137,\"(vide)\",\"\",ISBLANK(B137),\"\",B137)","v":0},0,0,null,null,"","","",""]
[null,null,null,null,null,"",{"$f":"_xlfn.SWITCH(B138,\"(vide)\",\"\",ISBLANK(B138),\"\",B138)","v":0},0,0,null,null,"","","",""]
[null,null,null,null,null,"",{"$f":"_xlfn.SWITCH(B139,\"(vide)\",\"\",ISBLANK(B139),\"\",B139)","v":0},0,0,null,null,"","","",""]
[null,null,null,null,null,"",{"$f":"_xlfn.SWITCH(B140,\"(vide)\",\"\",ISBLANK(B140),\"\",B140)","v":0},0,0,null,null,"","","",""]
[null,null,null,null,null,"",{"$f":"_xlfn.SWITCH(B141,\"(vide)\",\"\",ISBLANK(B141),\"\",B141)","v":0},0,0,null,null,"","","",""]
[null,null,null,null,null,"",{"$f":"_xlfn.SWITCH(B142,\"(vide)\",\"\",ISBLANK(B142),\"\",B142)","v":0},0,0,null,null,"","","",""]

{"sheet":"Norm TCD","index":21,"n_rows":142,"n_cols":15,"rows_kept":142,"cut":false,"hidden":true,"merged":[]}
["Pays","Provinces","Départements","CENTRE",null,{"$f":"A1","v":"Pays"},{"$f":"B1","v":"Provinces"},{"$f":"C1","v":"Départements"},"CENTRE",null,null,{"$f":"IF(F1=0,\"\",F1)","v":"Pays"},"Provinces","Départements","CENTRE"]
["France","Normandie","Calvados","Caen Ifs",null,{"$f":"IF(A2=\"\",\"\",A2)","v":"France"},{"$f":"IF(B2=\"(vide)\",\"\",B2)","v":"Normandie"},"Calvados","Caen Ifs",null,null,"France","Normandie","Calvados","Caen Ifs"]
["France","Normandie","Calvados","Caen Rosel",null,{"$f":"IF(A3=\"\",\"\",A3)","v":"France"},{"$f":"IF(B3=\"(vide)\",\"\",B3)","v":"Normandie"},"Calvados","Caen Rosel",null,null,{"$f":"IF(F3=0,\"\",F3)","v":"France"},{"$f":"IF(G3=0,\"\",G3)","v":"Normandie"},{"$f":"IF(H3=0,\"\",H3)","v":"Calvados"},{"$f":"IF(I3=0,\"\",I3)","v":"Caen Rosel"}]
["France","Normandie","Eure","Evreux",null,"France","Normandie","Eure","Evreux",null,null,{"$f":"IF(F4=0,\"\",F4)","v":"France"},"Normandie","Eure","Evreux"]
["France","Normandie","Manche","Cherbourg",null,"France",{"$f":"_xlfn.SWITCH(B5,\"(vide)\",\"\",ISBLANK(B5),\"\",B5)","v":"Normandie"},"Manche","Cherbourg",null,null,"France","Normandie","Manche","Cherbourg"]
["France","Normandie","Manche","Coutances",null,"France",{"$f":"_xlfn.SWITCH(B6,\"(vide)\",\"\",ISBLANK(B6),\"\",B6)","v":"Normandie"},"Manche","Coutances",null,null,"France","Normandie","Manche","Coutances"]
["France","Normandie","Manche","Equeurdreville",null,"France",{"$f":"_xlfn.SWITCH(B7,\"(vide)\",\"\",ISBLANK(B7),\"\",B7)","v":"Normandie"},"Manche","Equeurdreville",null,null,"France","Normandie","Manche","Equeurdreville"]
["France","Normandie","Orne","Alençon",null,"France",{"$f":"_xlfn.SWITCH(B8,\"(vide)\",\"\",ISBLANK(B8),\"\",B8)","v":"Normandie"},"Orne","Alençon",null,null,"France","Normandie","Orne","Alençon"]
["France","Normandie","Seine-Maritime","Elbeuf",null,"France",{"$f":"_xlfn.SWITCH(B9,\"(vide)\",\"\",ISBLANK(B9),\"\",B9)","v":"Normandie"},"Seine-Maritime","Elbeuf",null,null,"France","Normandie","Seine-Maritime","Elbeuf"]
["France","Normandie","Seine-Maritime","Havre",null,"France",{"$f":"_xlfn.SWITCH(B10,\"(vide)\",\"\",ISBLANK(B10),\"\",B10)","v":"Normandie"},"Seine-Maritime","Havre",null,null,"France","Normandie","Seine-Maritime","Havre"]
["France","Normandie","Seine-Maritime","Rouen St Etienne du Rouvray",null,"France",{"$f":"_xlfn.SWITCH(B11,\"(vide)\",\"\",ISBLANK(B11),\"\",B11)","v":"Normandie"},"Seine-Maritime","Rouen St Etienne du Rouvray",null,null,"France","Normandie","Seine-Maritime","Rouen St Etienne du Rouvray"]
[null,null,null,null,null,"",{"$f":"_xlfn.SWITCH(B12,\"(vide)\",\"\",ISBLANK(B12),\"\",B12)","v":0},0,0,null,null,"","","",""]
[null,null,null,null,null,"",{"$f":"_xlfn.SWITCH(B13,\"(vide)\",\"\",ISBLANK(B13),\"\",B13)","v":0},0,0,null,null,"","","",""]
[null,null,null,null,null,"",{"$f":"_xlfn.SWITCH(B14,\"(vide)\",\"\",ISBLANK(B14),\"\",B14)","v":0},0,0,null,null,"","","",""]
[null,null,null,null,null,"",{"$f":"_xlfn.SWITCH(B15,\"(vide)\",\"\",ISBLANK(B15),\"\",B15)","v":0},0,0,null,null,"","","",""]
[null,null,null,null,null,"",{"$f":"_xlfn.SWITCH(B16,\"(vide)\",\"\",ISBLANK(B16),\"\",B16)","v":0},0,0,null,null,"","","",""]
[null,null,null,null,null,"",{"$f":"_xlfn.SWITCH(B17,\"(vide)\",\"\",ISBLANK(B17),\"\",B17)","v":0},{"$f":"C17","v":0},0,null,null,"","","",""]
[null,null,null,null,null,"",{"$f":"_xlfn.SWITCH(B18,\"(vide)\",\"\",ISBLANK(B18),\"\",B18)","v":0},0,0,null,null,"","","",""]
[null,null,null,null,null,"",{"$f":"_xlfn.SWITCH(B19,\"(vide)\",\"\",ISBLANK(B19),\"\",B19)","v":0},0,0,null,null,"","","",""]
[null,null,null,null,null,"",{"$f":"_xlfn.SWITCH(B20,\"(vide)\",\"\",ISBLANK(B20),\"\",B20)","v":0},0,0,null,null,"","","",""]
[null,null,null,null,null,"",{"$f":"_xlfn.SWITCH(B21,\"(vide)\",\"\",ISBLANK(B21),\"\",B21)","v":0},0,0,null,null,"","","",""]
[null,null,null,null,null,"",{"$f":"_xlfn.SWITCH(B22,\"(vide)\",\"\",ISBLANK(B22),\"\",B22)","v":0},0,0,null,null,"","","",""]
[null,null,null,null,null,"",{"$f":"_xlfn.SWITCH(B23,\"(vide)\",\"\",ISBLANK(B23),\"\",B23)","v":0},0,0,null,null,"","","",""]
[null,null,null,null,null,"",{"$f":"_xlfn.SWITCH(B24,\"(vide)\",\"\",ISBLANK(B24),\"\",B24)","v":0},0,0,null,null,"","","",""]
[null,null,null,null,null,"",{"$f":"_xlfn.SWITCH(B25,\"(vide)\",\"\",ISBLANK(B25),\"\",B25)","v":0},0,0,null,null,"","","",""]
[null,null,null,null,null,"",{"$f":"_xlfn.SWITCH(B26,\"(vide)\",\"\",ISBLANK(B26),\"\",B26)","v":0},0,0,null,null,"","","",""]
[null,null,null,null,null,"",{"$f":"_xlfn.SWITCH(B27,\"(vide)\",\"\",ISBLANK(B27),\"\",B27)","v":0},0,0,null,null,"","","",""]
[null,null,null,null,null,"",{"$f":"_xlfn.SWITCH(B28,\"(vide)\",\"\",ISBLANK(B28),\"\",B28)","v":0},0,0,null,null,"","","",""]
[null,null,null,null,null,"",{"$f":"_xlfn.SWITCH(B29,\"(vide)\",\"\",ISBLANK(B29),\"\",B29)","v":0},0,0,null,null,"","","",""]
[null,null,null,null,null,"",{"$f":"_xlfn.SWITCH(B30,\"(vide)\",\"\",ISBLANK(B30),\"\",B30)","v":0},0,0,null,null,"","","",""]
[null,null,null,null,null,"",{"$f":"_xlfn.SWITCH(B31,\"(vide)\",\"\",ISBLANK(B31),\"\",B31)","v":0},0,0,null,null,"","","",""]
[null,null,null,null,null,"",{"$f":"_xlfn.SWITCH(B32,\"(vide)\",\"\",ISBLANK(B32),\"\",B32)","v":0},0,0,null,null,"","","",""]
[null,null,null,null,null,"",{"$f":"_xlfn.SWITCH(B33,\"(vide)\",\"\",ISBLANK(B33),\"\",B33)","v":0},0,0,null,null,"","","",""]
[null,null,null,null,null,"",{"$f":"_xlfn.SWITCH(B34,\"(vide)\",\"\",ISBLANK(B34),\"\",B34)","v":0},0,0,null,null,"","","",""]
[null,null,null,null,null,"",{"$f":"_xlfn.SWITCH(B35,\"(vide)\",\"\",ISBLANK(B35),\"\",B35)","v":0},0,0,null,null,"","","",""]
[null,null,null,null,null,"",{"$f":"_xlfn.SWITCH(B36,\"(vide)\",\"\",ISBLANK(B36),\"\",B36)","v":0},0,0,null,null,"","","",""]
[null,null,null,null,null,"",{"$f":"_xlfn.SWITCH(B37,\"(vide)\",\"\",ISBLANK(B37),\"\",B37)","v":0},0,0,null,null,"","","",""]
[null,null,null,null,null,"",{"$f":"_xlfn.SWITCH(B38,\"(vide)\",\"\",ISBLANK(B38),\"\",B38)","v":0},0,0,null,null,"","","",""]
[null,null,null,null,null,"",{"$f":"_xlfn.SWITCH(B39,\"(vide)\",\"\",ISBLANK(B39),\"\",B39)","v":0},0,0,null,null,"","","",""]
[null,null,null,null,null,"",{"$f":"_xlfn.SWITCH(B40,\"(vide)\",\"\",ISBLANK(B40),\"\",B40)","v":0},0,0,null,null,"","","",""]
[null,null,null,null,null,"",{"$f":"_xlfn.SWITCH(B41,\"(vide)\",\"\",ISBLANK(B41),\"\",B41)","v":0},0,0,null,null,"","","",""]
[null,null,null,null,null,"",{"$f":"_xlfn.SWITCH(B42,\"(vide)\",\"\",ISBLANK(B42),\"\",B42)","v":0},0,0,null,null,"","","",""]
[null,null,null,null,null,"",{"$f":"_xlfn.SWITCH(B43,\"(vide)\",\"\",ISBLANK(B43),\"\",B43)","v":0},0,0,null,null,"","","",""]
[null,null,null,null,null,"",{"$f":"_xlfn.SWITCH(B44,\"(vide)\",\"\",ISBLANK(B44),\"\",B44)","v":0},0,0,null,null,"","","",""]
[null,null,null,null,null,"",{"$f":"_xlfn.SWITCH(B45,\"(vide)\",\"\",ISBLANK(B45),\"\",B45)","v":0},0,0,null,null,"","","",""]
[null,null,null,null,null,"",{"$f":"_xlfn.SWITCH(B46,\"(vide)\",\"\",ISBLANK(B46),\"\",B46)","v":0},0,0,null,null,"","","",""]
[null,null,null,null,null,"",{"$f":"_xlfn.SWITCH(B47,\"(vide)\",\"\",ISBLANK(B47),\"\",B47)","v":0},0,0,null,null,"","","",""]
[null,null,null,null,null,"",{"$f":"_xlfn.SWITCH(B48,\"(vide)\",\"\",ISBLANK(B48),\"\",B48)","v":0},0,0,null,null,"","","",""]
[null,null,null,null,null,"",{"$f":"_xlfn.SWITCH(B49,\"(vide)\",\"\",ISBLANK(B49),\"\",B49)","v":0},0,0,null,null,"","","",""]
[null,null,null,null,null,"",{"$f":"_xlfn.SWITCH(B50,\"(vide)\",\"\",ISBLANK(B50),\"\",B50)","v":0},0,0,null,null,"","","",""]
[null,null,null,null,null,"",{"$f":"_xlfn.SWITCH(B51,\"(vide)\",\"\",ISBLANK(B51),\"\",B51)","v":0},0,0,null,null,"","","",""]
[null,null,null,null,null,"",{"$f":"_xlfn.SWITCH(B52,\"(vide)\",\"\",ISBLANK(B52),\"\",B52)","v":0},0,0,null,null,"","","",""]
[null,null,null,null,null,"",{"$f":"_xlfn.SWITCH(B53,\"(vide)\",\"\",ISBLANK(B53),\"\",B53)","v":0},0,0,null,null,"","","",""]
[null,null,null,null,null,"",{"$f":"_xlfn.SWITCH(B54,\"(vide)\",\"\",ISBLANK(B54),\"\",B54)","v":0},0,0,null,null,"","","",""]
[null,null,null,null,null,"",{"$f":"_xlfn.SWITCH(B55,\"(vide)\",\"\",ISBLANK(B55),\"\",B55)","v":0},0,0,null,null,"","","",""]
[null,null,null,null,null,"",{"$f":"_xlfn.SWITCH(B56,\"(vide)\",\"\",ISBLANK(B56),\"\",B56)","v":0},0,0,null,null,"","","",""]
[null,null,null,null,null,"",{"$f":"_xlfn.SWITCH(B57,\"(vide)\",\"\",ISBLANK(B57),\"\",B57)","v":0},0,0,null,null,"","","",""]
[null,null,null,null,null,"",{"$f":"_xlfn.SWITCH(B58,\"(vide)\",\"\",ISBLANK(B58),\"\",B58)","v":0},0,0,null,null,"","","",""]
[null,null,null,null,null,"",{"$f":"_xlfn.SWITCH(B59,\"(vide)\",\"\",ISBLANK(B59),\"\",B59)","v":0},0,0,null,null,"","","",""]
[null,null,null,null,null,"",{"$f":"_xlfn.SWITCH(B60,\"(vide)\",\"\",ISBLANK(B60),\"\",B60)","v":0},0,0,null,null,"","","",""]
[null,null,null,null,null,"",{"$f":"_xlfn.SWITCH(B61,\"(vide)\",\"\",ISBLANK(B61),\"\",B61)","v":0},0,0,null,null,"","","",""]
[null,null,null,null,null,"",{"$f":"_xlfn.SWITCH(B62,\"(vide)\",\"\",ISBLANK(B62),\"\",B62)","v":0},0,0,null,null,"","","",""]
[null,null,null,null,null,"",{"$f":"_xlfn.SWITCH(B63,\"(vide)\",\"\",ISBLANK(B63),\"\",B63)","v":0},0,0,null,null,"","","",""]
[null,null,null,null,null,"",{"$f":"_xlfn.SWITCH(B64,\"(vide)\",\"\",ISBLANK(B64),\"\",B64)","v":0},0,0,null,null,"","","",""]
[null,null,null,null,null,"",{"$f":"_xlfn.SWITCH(B65,\"(vide)\",\"\",ISBLANK(B65),\"\",B65)","v":0},0,0,null,null,"","","",""]
[null,null,null,null,null,"",{"$f":"_xlfn.SWITCH(B66,\"(vide)\",\"\",ISBLANK(B66),\"\",B66)","v":0},0,0,null,null,"","","",""]
[null,null,null,null,null,{"$f":"IF(A67=\"\",\"\",A67)","v":""},{"$f":"_xlfn.SWITCH(B67,\"(vide)\",\"\",ISBLANK(B67),\"\",B67)","v":0},0,0,null,null,"","","",{"$f":"IF(I67=0,\"\",I67)","v":""}]
[null,null,null,null,null,"",{"$f":"_xlfn.SWITCH(B68,\"(vide)\",\"\",ISBLANK(B68),\"\",B68)","v":0},0,0,null,null,{"$f":"IF(F68=0,\"\",F68)","v":""},"","",""]
[null,null,null,null,null,"",{"$f":"_xlfn.SWITCH(B69,\"(vide)\",\"\",ISBLANK(B69),\"\",B69)","v":0},0,0,null,null,"","","",""]
[null,null,null,null,null,"",{"$f":"_xlfn.SWITCH(B70,\"(vide)\",\"\",ISBLANK(B70),\"\",B70)","v":0},0,0,null,null,"","","",""]
[null,null,null,null,null,"",{"$f":"_xlfn.SWITCH(B71,\"(vide)\",\"\",ISBLANK(B71),\"\",B71)","v":0},0,0,null,null,"","","",""]
[null,null,null,null,null,"",{"$f":"_xlfn.SWITCH(B72,\"(vide)\",\"\",ISBLANK(B72),\"\",B72)","v":0},0,0,null,null,"","","",""]
[null,null,null,null,null,"",{"$f":"_xlfn.SWITCH(B73,\"(vide)\",\"\",ISBLANK(B73),\"\",B73)","v":0},0,0,null,null,"","","",""]
[null,null,null,null,null,"",{"$f":"_xlfn.SWITCH(B74,\"(vide)\",\"\",ISBLANK(B74),\"\",B74)","v":0},0,0,null,null,"","","",""]
[null,null,null,null,null,"",{"$f":"_xlfn.SWITCH(B75,\"(vide)\",\"\",ISBLANK(B75),\"\",B75)","v":0},0,0,null,null,"","","",""]
[null,null,null,null,null,"",{"$f":"_xlfn.SWITCH(B76,\"(vide)\",\"\",ISBLANK(B76),\"\",B76)","v":0},0,0,null,null,"","","",""]
[null,null,null,null,null,"",{"$f":"_xlfn.SWITCH(B77,\"(vide)\",\"\",ISBLANK(B77),\"\",B77)","v":0},0,0,null,null,"","","",""]
[null,null,null,null,null,"",{"$f":"_xlfn.SWITCH(B78,\"(vide)\",\"\",ISBLANK(B78),\"\",B78)","v":0},0,0,null,null,"","","",""]
[null,null,null,null,null,"",{"$f":"_xlfn.SWITCH(B79,\"(vide)\",\"\",ISBLANK(B79),\"\",B79)","v":0},0,0,null,null,"","","",""]
[null,null,null,null,null,"",{"$f":"_xlfn.SWITCH(B80,\"(vide)\",\"\",ISBLANK(B80),\"\",B80)","v":0},0,0,null,null,"","","",""]
[null,null,null,null,null,"",{"$f":"_xlfn.SWITCH(B81,\"(vide)\",\"\",ISBLANK(B81),\"\",B81)","v":0},{"$f":"C81","v":0},0,null,null,"","","",""]
[null,null,null,null,null,"",{"$f":"_xlfn.SWITCH(B82,\"(vide)\",\"\",ISBLANK(B82),\"\",B82)","v":0},0,0,null,null,"","","",""]
[null,null,null,null,null,"",{"$f":"_xlfn.SWITCH(B83,\"(vide)\",\"\",ISBLANK(B83),\"\",B83)","v":0},0,0,null,null,"","","",""]
[null,null,null,null,null,"",{"$f":"_xlfn.SWITCH(B84,\"(vide)\",\"\",ISBLANK(B84),\"\",B84)","v":0},0,0,null,null,"","","",""]
[null,null,null,null,null,"",{"$f":"_xlfn.SWITCH(B85,\"(vide)\",\"\",ISBLANK(B85),\"\",B85)","v":0},0,0,null,null,"","","",""]
[null,null,null,null,null,"",{"$f":"_xlfn.SWITCH(B86,\"(vide)\",\"\",ISBLANK(B86),\"\",B86)","v":0},0,0,null,null,"","","",""]
[null,null,null,null,null,"",{"$f":"_xlfn.SWITCH(B87,\"(vide)\",\"\",ISBLANK(B87),\"\",B87)","v":0},0,0,null,null,"","","",""]
[null,null,null,null,null,"",{"$f":"_xlfn.SWITCH(B88,\"(vide)\",\"\",ISBLANK(B88),\"\",B88)","v":0},0,0,null,null,"","","",""]
[null,null,null,null,null,"",{"$f":"_xlfn.SWITCH(B89,\"(vide)\",\"\",ISBLANK(B89),\"\",B89)","v":0},0,0,null,null,"","","",""]
[null,null,null,null,null,"",{"$f":"_xlfn.SWITCH(B90,\"(vide)\",\"\",ISBLANK(B90),\"\",B90)","v":0},0,0,null,null,"","","",""]
[null,null,null,null,null,"",{"$f":"_xlfn.SWITCH(B91,\"(vide)\",\"\",ISBLANK(B91),\"\",B91)","v":0},0,0,null,null,"","","",""]
[null,null,null,null,null,"",{"$f":"_xlfn.SWITCH(B92,\"(vide)\",\"\",ISBLANK(B92),\"\",B92)","v":0},0,0,null,null,"","","",""]
[null,null,null,null,null,"",{"$f":"_xlfn.SWITCH(B93,\"(vide)\",\"\",ISBLANK(B93),\"\",B93)","v":0},0,0,null,null,"","","",""]
[null,null,null,null,null,"",{"$f":"_xlfn.SWITCH(B94,\"(vide)\",\"\",ISBLANK(B94),\"\",B94)","v":0},0,0,null,null,"","","",""]
[null,null,null,null,null,"",{"$f":"_xlfn.SWITCH(B95,\"(vide)\",\"\",ISBLANK(B95),\"\",B95)","v":0},0,0,null,null,"","","",""]
[null,null,null,null,null,"",{"$f":"_xlfn.SWITCH(B96,\"(vide)\",\"\",ISBLANK(B96),\"\",B96)","v":0},0,0,null,null,"","","",""]
[null,null,null,null,null,"",{"$f":"_xlfn.SWITCH(B97,\"(vide)\",\"\",ISBLANK(B97),\"\",B97)","v":0},0,0,null,null,"","","",""]
[null,null,null,null,null,"",{"$f":"_xlfn.SWITCH(B98,\"(vide)\",\"\",ISBLANK(B98),\"\",B98)","v":0},0,0,null,null,"","","",""]
[null,null,null,null,null,"",{"$f":"_xlfn.SWITCH(B99,\"(vide)\",\"\",ISBLANK(B99),\"\",B99)","v":0},0,0,null,null,"","","",""]
[null,null,null,null,null,"",{"$f":"_xlfn.SWITCH(B100,\"(vide)\",\"\",ISBLANK(B100),\"\",B100)","v":0},0,0,null,null,"","","",""]
[null,null,null,null,null,"",{"$f":"_xlfn.SWITCH(B101,\"(vide)\",\"\",ISBLANK(B101),\"\",B101)","v":0},0,0,null,null,"","","",""]
[null,null,null,null,null,"",{"$f":"_xlfn.SWITCH(B102,\"(vide)\",\"\",ISBLANK(B102),\"\",B102)","v":0},0,0,null,null,"","","",""]
[null,null,null,null,null,"",{"$f":"_xlfn.SWITCH(B103,\"(vide)\",\"\",ISBLANK(B103),\"\",B103)","v":0},0,0,null,null,"","","",""]
[null,null,null,null,null,"",{"$f":"_xlfn.SWITCH(B104,\"(vide)\",\"\",ISBLANK(B104),\"\",B104)","v":0},0,0,null,null,"","","",""]
[null,null,null,null,null,"",{"$f":"_xlfn.SWITCH(B105,\"(vide)\",\"\",ISBLANK(B105),\"\",B105)","v":0},0,0,null,null,"","","",""]
[null,null,null,null,null,"",{"$f":"_xlfn.SWITCH(B106,\"(vide)\",\"\",ISBLANK(B106),\"\",B106)","v":0},0,0,null,null,"","","",""]
[null,null,null,null,null,"",{"$f":"_xlfn.SWITCH(B107,\"(vide)\",\"\",ISBLANK(B107),\"\",B107)","v":0},0,0,null,null,"","","",""]
[null,null,null,null,null,"",{"$f":"_xlfn.SWITCH(B108,\"(vide)\",\"\",ISBLANK(B108),\"\",B108)","v":0},0,0,null,null,"","","",""]
[null,null,null,null,null,"",{"$f":"_xlfn.SWITCH(B109,\"(vide)\",\"\",ISBLANK(B109),\"\",B109)","v":0},0,0,null,null,"","","",""]
[null,null,null,null,null,"",{"$f":"_xlfn.SWITCH(B110,\"(vide)\",\"\",ISBLANK(B110),\"\",B110)","v":0},0,0,null,null,"","","",""]
[null,null,null,null,null,"",{"$f":"_xlfn.SWITCH(B111,\"(vide)\",\"\",ISBLANK(B111),\"\",B111)","v":0},0,0,null,null,"","","",""]
[null,null,null,null,null,"",{"$f":"_xlfn.SWITCH(B112,\"(vide)\",\"\",ISBLANK(B112),\"\",B112)","v":0},0,0,null,null,"","","",""]
[null,null,null,null,null,"",{"$f":"_xlfn.SWITCH(B113,\"(vide)\",\"\",ISBLANK(B113),\"\",B113)","v":0},0,0,null,null,"","","",""]
[null,null,null,null,null,"",{"$f":"_xlfn.SWITCH(B114,\"(vide)\",\"\",ISBLANK(B114),\"\",B114)","v":0},0,0,null,null,"","","",""]
[null,null,null,null,null,"",{"$f":"_xlfn.SWITCH(B115,\"(vide)\",\"\",ISBLANK(B115),\"\",B115)","v":0},0,0,null,null,"","","",""]
[null,null,null,null,null,"",{"$f":"_xlfn.SWITCH(B116,\"(vide)\",\"\",ISBLANK(B116),\"\",B116)","v":0},0,0,null,null,"","","",""]
[null,null,null,null,null,"",{"$f":"_xlfn.SWITCH(B117,\"(vide)\",\"\",ISBLANK(B117),\"\",B117)","v":0},0,0,null,null,"","","",""]
[null,null,null,null,null,"",{"$f":"_xlfn.SWITCH(B118,\"(vide)\",\"\",ISBLANK(B118),\"\",B118)","v":0},0,0,null,null,"","","",""]
[null,null,null,null,null,"",{"$f":"_xlfn.SWITCH(B119,\"(vide)\",\"\",ISBLANK(B119),\"\",B119)","v":0},0,0,null,null,"","","",""]
[null,null,null,null,null,"",{"$f":"_xlfn.SWITCH(B120,\"(vide)\",\"\",ISBLANK(B120),\"\",B120)","v":0},0,0,null,null,"","","",""]
[null,null,null,null,null,"",{"$f":"_xlfn.SWITCH(B121,\"(vide)\",\"\",ISBLANK(B121),\"\",B121)","v":0},0,0,null,null,"","","",""]
[null,null,null,null,null,"",{"$f":"_xlfn.SWITCH(B122,\"(vide)\",\"\",ISBLANK(B122),\"\",B122)","v":0},0,0,null,null,"","","",""]
[null,null,null,null,null,"",{"$f":"_xlfn.SWITCH(B123,\"(vide)\",\"\",ISBLANK(B123),\"\",B123)","v":0},0,0,null,null,"","","",""]
[null,null,null,null,null,"",{"$f":"_xlfn.SWITCH(B124,\"(vide)\",\"\",ISBLANK(B124),\"\",B124)","v":0},0,0,null,null,"","","",""]
[null,null,null,null,null,"",{"$f":"_xlfn.SWITCH(B125,\"(vide)\",\"\",ISBLANK(B125),\"\",B125)","v":0},0,0,null,null,"","","",""]
[null,null,null,null,null,"",{"$f":"_xlfn.SWITCH(B126,\"(vide)\",\"\",ISBLANK(B126),\"\",B126)","v":0},0,0,null,null,"","","",""]
[null,null,null,null,null,"",{"$f":"_xlfn.SWITCH(B127,\"(vide)\",\"\",ISBLANK(B127),\"\",B127)","v":0},0,0,null,null,"","","",""]
[null,null,null,null,null,"",{"$f":"_xlfn.SWITCH(B128,\"(vide)\",\"\",ISBLANK(B128),\"\",B128)","v":0},0,0,null,null,"","","",""]
[null,null,null,null,null,"",{"$f":"_xlfn.SWITCH(B129,\"(vide)\",\"\",ISBLANK(B129),\"\",B129)","v":0},0,0,null,null,"","","",""]
[null,null,null,null,null,"",{"$f":"_xlfn.SWITCH(B130,\"(vide)\",\"\",ISBLANK(B130),\"\",B130)","v":0},0,0,null,null,"","","",""]
[null,null,null,null,null,{"$f":"IF(A131=\"\",\"\",A131)","v":""},{"$f":"_xlfn.SWITCH(B131,\"(vide)\",\"\",ISBLANK(B131),\"\",B131)","v":0},0,0,null,null,"","","",""]
[null,null,null,null,null,"",{"$f":"_xlfn.SWITCH(B132,\"(vide)\",\"\",ISBLANK(B132),\"\",B132)","v":0},0,0,null,null,{"$f":"IF(F132=0,\"\",F132)","v":""},"","",""]
[null,null,null,null,null,"",{"$f":"_xlfn.SWITCH(B133,\"(vide)\",\"\",ISBLANK(B133),\"\",B133)","v":0},0,0,null,null,"","","",""]
[null,null,null,null,null,"",{"$f":"_xlfn.SWITCH(B134,\"(vide)\",\"\",ISBLANK(B134),\"\",B134)","v":0},0,0,null,null,"","","",""]
[null,null,null,null,null,"",{"$f":"_xlfn.SWITCH(B135,\"(vide)\",\"\",ISBLANK(B135),\"\",B135)","v":0},0,0,null,null,"","","",""]
[null,null,null,null,null,"",{"$f":"_xlfn.SWITCH(B136,\"(vide)\",\"\",ISBLANK(B136),\"\",B136)","v":0},0,0,null,null,"","","",""]
[null,null,null,null,null,"",{"$f":"_xlfn.SWITCH(B137,\"(vide)\",\"\",ISBLANK(B137),\"\",B137)","v":0},0,0,null,null,"","","",""]
[null,null,null,null,null,"",{"$f":"_xlfn.SWITCH(B138,\"(vide)\",\"\",ISBLANK(B138),\"\",B138)","v":0},0,0,null,null,"","","",""]
[null,null,null,null,null,"",{"$f":"_xlfn.SWITCH(B139,\"(vide)\",\"\",ISBLANK(B139),\"\",B139)","v":0},0,0,null,null,"","","",""]
[null,null,null,null,null,"",{"$f":"_xlfn.SWITCH(B140,\"(vide)\",\"\",ISBLANK(B140),\"\",B140)","v":0},0,0,null,null,"","","",""]
[null,null,null,null,null,"",{"$f":"_xlfn.SWITCH(B141,\"(vide)\",\"\",ISBLANK(B141),\"\",B141)","v":0},0,0,null,null,"","","",""]
[null,null,null,null,null,"",{"$f":"_xlfn.SWITCH(B142,\"(vide)\",\"\",ISBLANK(B142),\"\",B142)","v":0},0,0,null,null,"","","",""]

{"sheet":"Norm","index":22,"n_rows":1,"n_cols":1,"rows_kept":1,"cut":false,"hidden":false,"merged":[[0,0,2,22]]}
["REGION\nNORMANDIE"]

{"sheet":"NA TCD","index":23,"n_rows":142,"n_cols":15,"rows_kept":142,"cut":false,"hidden":true,"merged":[]}
["Pays","Provinces","Départements","CENTRE",null,{"$f":"A1","v":"Pays"},{"$f":"B1","v":"Provinces"},{"$f":"C1","v":"Départements"},"CENTRE",null,null,{"$f":"IF(F1=0,\"\",F1)","v":"Pays"},"Provinces","Départements","CENTRE"]
["France","Nouvelle-Aquitaine","Charente","Angoulême La Braconne",null,{"$f":"IF(A2=\"\",\"\",A2)","v":"France"},{"$f":"IF(B2=\"(vide)\",\"\",B2)","v":"Nouvelle-Aquitaine"},"Charente","Angoulême La Braconne",null,null,"France","Nouvelle-Aquitaine","Charente","Angoulême La Braconne"]
["France","Nouvelle-Aquitaine","Charente-Maritime","Rochefort",null,{"$f":"IF(A3=\"\",\"\",A3)","v":"France"},{"$f":"IF(B3=\"(vide)\",\"\",B3)","v":"Nouvelle-Aquitaine"},"Charente-Maritime","Rochefort",null,null,{"$f":"IF(F3=0,\"\",F3)","v":"France"},{"$f":"IF(G3=0,\"\",G3)","v":"Nouvelle-Aquitaine"},{"$f":"IF(H3=0,\"\",H3)","v":"Charente-Maritime"},{"$f":"IF(I3=0,\"\",I3)","v":"Rochefort"}]
["France","Nouvelle-Aquitaine","Corrèze","Brive la Gaillarde",null,"France","Nouvelle-Aquitaine","Corrèze","Brive la Gaillarde",null,null,{"$f":"IF(F4=0,\"\",F4)","v":"France"},"Nouvelle-Aquitaine","Corrèze","Brive la Gaillarde"]
["France","Nouvelle-Aquitaine","Corrèze","Egletons",null,"France",{"$f":"_xlfn.SWITCH(B5,\"(vide)\",\"\",ISBLANK(B5),\"\",B5)","v":"Nouvelle-Aquitaine"},"Corrèze","Egletons",null,null,"France","Nouvelle-Aquitaine","Corrèze","Egletons"]
["France","Nouvelle-Aquitaine","Creuse","Guéret",null,"France",{"$f":"_xlfn.SWITCH(B6,\"(vide)\",\"\",ISBLANK(B6),\"\",B6)","v":"Nouvelle-Aquitaine"},"Creuse","Guéret",null,null,"France","Nouvelle-Aquitaine","Creuse","Guéret"]
["France","Nouvelle-Aquitaine","Deux-Sèvres","Niort",null,"France",{"$f":"_xlfn.SWITCH(B7,\"(vide)\",\"\",ISBLANK(B7),\"\",B7)","v":"Nouvelle-Aquitaine"},"Deux-Sèvres","Niort",null,null,"France","Nouvelle-Aquitaine","Deux-Sèvres","Niort"]
["France","Nouvelle-Aquitaine","Dordogne","Périgueux Boulazac",null,"France",{"$f":"_xlfn.SWITCH(B8,\"(vide)\",\"\",ISBLANK(B8),\"\",B8)","v":"Nouvelle-Aquitaine"},"Dordogne","Périgueux Boulazac",null,null,"France","Nouvelle-Aquitaine","Dordogne","Périgueux Boulazac"]
["France","Nouvelle-Aquitaine","Gironde","Bordeaux Bègles",null,"France",{"$f":"_xlfn.SWITCH(B9,\"(vide)\",\"\",ISBLANK(B9),\"\",B9)","v":"Nouvelle-Aquitaine"},"Gironde","Bordeaux Bègles",null,null,"France","Nouvelle-Aquitaine","Gironde","Bordeaux Bègles"]
["France","Nouvelle-Aquitaine","Gironde","Bordeaux Caudéran",null,"France",{"$f":"_xlfn.SWITCH(B10,\"(vide)\",\"\",ISBLANK(B10),\"\",B10)","v":"Nouvelle-Aquitaine"},"Gironde","Bordeaux Caudéran",null,null,"France","Nouvelle-Aquitaine","Gironde","Bordeaux Caudéran"]
["France","Nouvelle-Aquitaine","Gironde","Bordeaux Pessac",null,"France",{"$f":"_xlfn.SWITCH(B11,\"(vide)\",\"\",ISBLANK(B11),\"\",B11)","v":"Nouvelle-Aquitaine"},"Gironde","Bordeaux Pessac",null,null,"France","Nouvelle-Aquitaine","Gironde","Bordeaux Pessac"]
["France","Nouvelle-Aquitaine","Haute-Vienne","Limoges  Babylone",null,"France",{"$f":"_xlfn.SWITCH(B12,\"(vide)\",\"\",ISBLANK(B12),\"\",B12)","v":"Nouvelle-Aquitaine"},"Haute-Vienne","Limoges  Babylone",null,null,"France","Nouvelle-Aquitaine","Haute-Vienne","Limoges  Babylone"]
["France","Nouvelle-Aquitaine","Haute-Vienne","Limoges Romanet",null,"France",{"$f":"_xlfn.SWITCH(B13,\"(vide)\",\"\",ISBLANK(B13),\"\",B13)","v":"Nouvelle-Aquitaine"},"Haute-Vienne","Limoges Romanet",null,null,"France","Nouvelle-Aquitaine","Haute-Vienne","Limoges Romanet"]
["France","Nouvelle-Aquitaine","Landes","Mont de Marsan",null,"France",{"$f":"_xlfn.SWITCH(B14,\"(vide)\",\"\",ISBLANK(B14),\"\",B14)","v":"Nouvelle-Aquitaine"},"Landes","Mont de Marsan",null,null,"France","Nouvelle-Aquitaine","Landes","Mont de Marsan"]
["France","Nouvelle-Aquitaine","Lot-et-Garonne","Agen Foulayronnes",null,"France",{"$f":"_xlfn.SWITCH(B15,\"(vide)\",\"\",ISBLANK(B15),\"\",B15)","v":"Nouvelle-Aquitaine"},"Lot-et-Garonne","Agen Foulayronnes",null,null,"France","Nouvelle-Aquitaine","Lot-et-Garonne","Agen Foulayronnes"]
["France","Nouvelle-Aquitaine","Pyrénées-Atlantiques","Bayonne",null,"France",{"$f":"_xlfn.SWITCH(B16,\"(vide)\",\"\",ISBLANK(B16),\"\",B16)","v":"Nouvelle-Aquitaine"},"Pyrénées-Atlantiques","Bayonne",null,null,"France","Nouvelle-Aquitaine","Pyrénées-Atlantiques","Bayonne"]
["France","Nouvelle-Aquitaine","Pyrénées-Atlantiques","Pau",null,"France",{"$f":"_xlfn.SWITCH(B17,\"(vide)\",\"\",ISBLANK(B17),\"\",B17)","v":"Nouvelle-Aquitaine"},{"$f":"C17","v":"Pyrénées-Atlantiques"},"Pau",null,null,"France","Nouvelle-Aquitaine","Pyrénées-Atlantiques","Pau"]
["France","Nouvelle-Aquitaine","Vienne","Châtellerault",null,"France",{"$f":"_xlfn.SWITCH(B18,\"(vide)\",\"\",ISBLANK(B18),\"\",B18)","v":"Nouvelle-Aquitaine"},"Vienne","Châtellerault",null,null,"France","Nouvelle-Aquitaine","Vienne","Châtellerault"]
["France","Nouvelle-Aquitaine","Vienne","Vigeant",null,"France",{"$f":"_xlfn.SWITCH(B19,\"(vide)\",\"\",ISBLANK(B19),\"\",B19)","v":"Nouvelle-Aquitaine"},"Vienne","Vigeant",null,null,"France","Nouvelle-Aquitaine","Vienne","Vigeant"]
[null,null,null,null,null,"",{"$f":"_xlfn.SWITCH(B20,\"(vide)\",\"\",ISBLANK(B20),\"\",B20)","v":0},0,0,null,null,"","","",""]
[null,null,null,null,null,"",{"$f":"_xlfn.SWITCH(B21,\"(vide)\",\"\",ISBLANK(B21),\"\",B21)","v":0},0,0,null,null,"","","",""]
[null,null,null,null,null,"",{"$f":"_xlfn.SWITCH(B22,\"(vide)\",\"\",ISBLANK(B22),\"\",B22)","v":0},0,0,null,null,"","","",""]
[null,null,null,null,null,"",{"$f":"_xlfn.SWITCH(B23,\"(vide)\",\"\",ISBLANK(B23),\"\",B23)","v":0},0,0,null,null,"","","",""]
[null,null,null,null,null,"",{"$f":"_xlfn.SWITCH(B24,\"(vide)\",\"\",ISBLANK(B24),\"\",B24)","v":0},0,0,null,null,"","","",""]
[null,null,null,null,null,"",{"$f":"_xlfn.SWITCH(B25,\"(vide)\",\"\",ISBLANK(B25),\"\",B25)","v":0},0,0,null,null,"","","",""]
[null,null,null,null,null,"",{"$f":"_xlfn.SWITCH(B26,\"(vide)\",\"\",ISBLANK(B26),\"\",B26)","v":0},0,0,null,null,"","","",""]
[null,null,null,null,null,"",{"$f":"_xlfn.SWITCH(B27,\"(vide)\",\"\",ISBLANK(B27),\"\",B27)","v":0},0,0,null,null,"","","",""]
[null,null,null,null,null,"",{"$f":"_xlfn.SWITCH(B28,\"(vide)\",\"\",ISBLANK(B28),\"\",B28)","v":0},0,0,null,null,"","","",""]
[null,null,null,null,null,"",{"$f":"_xlfn.SWITCH(B29,\"(vide)\",\"\",ISBLANK(B29),\"\",B29)","v":0},0,0,null,null,"","","",""]
[null,null,null,null,null,"",{"$f":"_xlfn.SWITCH(B30,\"(vide)\",\"\",ISBLANK(B30),\"\",B30)","v":0},0,0,null,null,"","","",""]
[null,null,null,null,null,"",{"$f":"_xlfn.SWITCH(B31,\"(vide)\",\"\",ISBLANK(B31),\"\",B31)","v":0},0,0,null,null,"","","",""]
[null,null,null,null,null,"",{"$f":"_xlfn.SWITCH(B32,\"(vide)\",\"\",ISBLANK(B32),\"\",B32)","v":0},0,0,null,null,"","","",""]
[null,null,null,null,null,"",{"$f":"_xlfn.SWITCH(B33,\"(vide)\",\"\",ISBLANK(B33),\"\",B33)","v":0},0,0,null,null,"","","",""]
[null,null,null,null,null,"",{"$f":"_xlfn.SWITCH(B34,\"(vide)\",\"\",ISBLANK(B34),\"\",B34)","v":0},0,0,null,null,"","","",""]
[null,null,null,null,null,"",{"$f":"_xlfn.SWITCH(B35,\"(vide)\",\"\",ISBLANK(B35),\"\",B35)","v":0},0,0,null,null,"","","",""]
[null,null,null,null,null,"",{"$f":"_xlfn.SWITCH(B36,\"(vide)\",\"\",ISBLANK(B36),\"\",B36)","v":0},0,0,null,null,"","","",""]
[null,null,null,null,null,"",{"$f":"_xlfn.SWITCH(B37,\"(vide)\",\"\",ISBLANK(B37),\"\",B37)","v":0},0,0,null,null,"","","",""]
[null,null,null,null,null,"",{"$f":"_xlfn.SWITCH(B38,\"(vide)\",\"\",ISBLANK(B38),\"\",B38)","v":0},0,0,null,null,"","","",""]
[null,null,null,null,null,"",{"$f":"_xlfn.SWITCH(B39,\"(vide)\",\"\",ISBLANK(B39),\"\",B39)","v":0},0,0,null,null,"","","",""]
[null,null,null,null,null,"",{"$f":"_xlfn.SWITCH(B40,\"(vide)\",\"\",ISBLANK(B40),\"\",B40)","v":0},0,0,null,null,"","","",""]
[null,null,null,null,null,"",{"$f":"_xlfn.SWITCH(B41,\"(vide)\",\"\",ISBLANK(B41),\"\",B41)","v":0},0,0,null,null,"","","",""]
[null,null,null,null,null,"",{"$f":"_xlfn.SWITCH(B42,\"(vide)\",\"\",ISBLANK(B42),\"\",B42)","v":0},0,0,null,null,"","","",""]
[null,null,null,null,null,"",{"$f":"_xlfn.SWITCH(B43,\"(vide)\",\"\",ISBLANK(B43),\"\",B43)","v":0},0,0,null,null,"","","",""]
[null,null,null,null,null,"",{"$f":"_xlfn.SWITCH(B44,\"(vide)\",\"\",ISBLANK(B44),\"\",B44)","v":0},0,0,null,null,"","","",""]
[null,null,null,null,null,"",{"$f":"_xlfn.SWITCH(B45,\"(vide)\",\"\",ISBLANK(B45),\"\",B45)","v":0},0,0,null,null,"","","",""]
[null,null,null,null,null,"",{"$f":"_xlfn.SWITCH(B46,\"(vide)\",\"\",ISBLANK(B46),\"\",B46)","v":0},0,0,null,null,"","","",""]
[null,null,null,null,null,"",{"$f":"_xlfn.SWITCH(B47,\"(vide)\",\"\",ISBLANK(B47),\"\",B47)","v":0},0,0,null,null,"","","",""]
[null,null,null,null,null,"",{"$f":"_xlfn.SWITCH(B48,\"(vide)\",\"\",ISBLANK(B48),\"\",B48)","v":0},0,0,null,null,"","","",""]
[null,null,null,null,null,"",{"$f":"_xlfn.SWITCH(B49,\"(vide)\",\"\",ISBLANK(B49),\"\",B49)","v":0},0,0,null,null,"","","",""]
[null,null,null,null,null,"",{"$f":"_xlfn.SWITCH(B50,\"(vide)\",\"\",ISBLANK(B50),\"\",B50)","v":0},0,0,null,null,"","","",""]
[null,null,null,null,null,"",{"$f":"_xlfn.SWITCH(B51,\"(vide)\",\"\",ISBLANK(B51),\"\",B51)","v":0},0,0,null,null,"","","",""]
[null,null,null,null,null,"",{"$f":"_xlfn.SWITCH(B52,\"(vide)\",\"\",ISBLANK(B52),\"\",B52)","v":0},0,0,null,null,"","","",""]
[null,null,null,null,null,"",{"$f":"_xlfn.SWITCH(B53,\"(vide)\",\"\",ISBLANK(B53),\"\",B53)","v":0},0,0,null,null,"","","",""]
[null,null,null,null,null,"",{"$f":"_xlfn.SWITCH(B54,\"(vide)\",\"\",ISBLANK(B54),\"\",B54)","v":0},0,0,null,null,"","","",""]
[null,null,null,null,null,"",{"$f":"_xlfn.SWITCH(B55,\"(vide)\",\"\",ISBLANK(B55),\"\",B55)","v":0},0,0,null,null,"","","",""]
[null,null,null,null,null,"",{"$f":"_xlfn.SWITCH(B56,\"(vide)\",\"\",ISBLANK(B56),\"\",B56)","v":0},0,0,null,null,"","","",""]
[null,null,null,null,null,"",{"$f":"_xlfn.SWITCH(B57,\"(vide)\",\"\",ISBLANK(B57),\"\",B57)","v":0},0,0,null,null,"","","",""]
[null,null,null,null,null,"",{"$f":"_xlfn.SWITCH(B58,\"(vide)\",\"\",ISBLANK(B58),\"\",B58)","v":0},0,0,null,null,"","","",""]
[null,null,null,null,null,"",{"$f":"_xlfn.SWITCH(B59,\"(vide)\",\"\",ISBLANK(B59),\"\",B59)","v":0},0,0,null,null,"","","",""]
[null,null,null,null,null,"",{"$f":"_xlfn.SWITCH(B60,\"(vide)\",\"\",ISBLANK(B60),\"\",B60)","v":0},0,0,null,null,"","","",""]
[null,null,null,null,null,"",{"$f":"_xlfn.SWITCH(B61,\"(vide)\",\"\",ISBLANK(B61),\"\",B61)","v":0},0,0,null,null,"","","",""]
[null,null,null,null,null,"",{"$f":"_xlfn.SWITCH(B62,\"(vide)\",\"\",ISBLANK(B62),\"\",B62)","v":0},0,0,null,null,"","","",""]
[null,null,null,null,null,"",{"$f":"_xlfn.SWITCH(B63,\"(vide)\",\"\",ISBLANK(B63),\"\",B63)","v":0},0,0,null,null,"","","",""]
[null,null,null,null,null,"",{"$f":"_xlfn.SWITCH(B64,\"(vide)\",\"\",ISBLANK(B64),\"\",B64)","v":0},0,0,null,null,"","","",""]
[null,null,null,null,null,"",{"$f":"_xlfn.SWITCH(B65,\"(vide)\",\"\",ISBLANK(B65),\"\",B65)","v":0},0,0,null,null,"","","",""]
[null,null,null,null,null,"",{"$f":"_xlfn.SWITCH(B66,\"(vide)\",\"\",ISBLANK(B66),\"\",B66)","v":0},0,0,null,null,"","","",""]
[null,null,null,null,null,{"$f":"IF(A67=\"\",\"\",A67)","v":""},{"$f":"_xlfn.SWITCH(B67,\"(vide)\",\"\",ISBLANK(B67),\"\",B67)","v":0},0,0,null,null,"","","",{"$f":"IF(I67=0,\"\",I67)","v":""}]
[null,null,null,null,null,"",{"$f":"_xlfn.SWITCH(B68,\"(vide)\",\"\",ISBLANK(B68),\"\",B68)","v":0},0,0,null,null,{"$f":"IF(F68=0,\"\",F68)","v":""},"","",""]
[null,null,null,null,null,"",{"$f":"_xlfn.SWITCH(B69,\"(vide)\",\"\",ISBLANK(B69),\"\",B69)","v":0},0,0,null,null,"","","",""]
[null,null,null,null,null,"",{"$f":"_xlfn.SWITCH(B70,\"(vide)\",\"\",ISBLANK(B70),\"\",B70)","v":0},0,0,null,null,"","","",""]
[null,null,null,null,null,"",{"$f":"_xlfn.SWITCH(B71,\"(vide)\",\"\",ISBLANK(B71),\"\",B71)","v":0},0,0,null,null,"","","",""]
[null,null,null,null,null,"",{"$f":"_xlfn.SWITCH(B72,\"(vide)\",\"\",ISBLANK(B72),\"\",B72)","v":0},0,0,null,null,"","","",""]
[null,null,null,null,null,"",{"$f":"_xlfn.SWITCH(B73,\"(vide)\",\"\",ISBLANK(B73),\"\",B73)","v":0},0,0,null,null,"","","",""]
[null,null,null,null,null,"",{"$f":"_xlfn.SWITCH(B74,\"(vide)\",\"\",ISBLANK(B74),\"\",B74)","v":0},0,0,null,null,"","","",""]
[null,null,null,null,null,"",{"$f":"_xlfn.SWITCH(B75,\"(vide)\",\"\",ISBLANK(B75),\"\",B75)","v":0},0,0,null,null,"","","",""]
[null,null,null,null,null,"",{"$f":"_xlfn.SWITCH(B76,\"(vide)\",\"\",ISBLANK(B76),\"\",B76)","v":0},0,0,null,null,"","","",""]
[null,null,null,null,null,"",{"$f":"_xlfn.SWITCH(B77,\"(vide)\",\"\",ISBLANK(B77),\"\",B77)","v":0},0,0,null,null,"","","",""]
[null,null,null,null,null,"",{"$f":"_xlfn.SWITCH(B78,\"(vide)\",\"\",ISBLANK(B78),\"\",B78)","v":0},0,0,null,null,"","","",""]
[null,null,null,null,null,"",{"$f":"_xlfn.SWITCH(B79,\"(vide)\",\"\",ISBLANK(B79),\"\",B79)","v":0},0,0,null,null,"","","",""]
[null,null,null,null,null,"",{"$f":"_xlfn.SWITCH(B80,\"(vide)\",\"\",ISBLANK(B80),\"\",B80)","v":0},0,0,null,null,"","","",""]
[null,null,null,null,null,"",{"$f":"_xlfn.SWITCH(B81,\"(vide)\",\"\",ISBLANK(B81),\"\",B81)","v":0},{"$f":"C81","v":0},0,null,null,"","","",""]
[null,null,null,null,null,"",{"$f":"_xlfn.SWITCH(B82,\"(vide)\",\"\",ISBLANK(B82),\"\",B82)","v":0},0,0,null,null,"","","",""]
[null,null,null,null,null,"",{"$f":"_xlfn.SWITCH(B83,\"(vide)\",\"\",ISBLANK(B83),\"\",B83)","v":0},0,0,null,null,"","","",""]
[null,null,null,null,null,"",{"$f":"_xlfn.SWITCH(B84,\"(vide)\",\"\",ISBLANK(B84),\"\",B84)","v":0},0,0,null,null,"","","",""]
[null,null,null,null,null,"",{"$f":"_xlfn.SWITCH(B85,\"(vide)\",\"\",ISBLANK(B85),\"\",B85)","v":0},0,0,null,null,"","","",""]
[null,null,null,null,null,"",{"$f":"_xlfn.SWITCH(B86,\"(vide)\",\"\",ISBLANK(B86),\"\",B86)","v":0},0,0,null,null,"","","",""]
[null,null,null,null,null,"",{"$f":"_xlfn.SWITCH(B87,\"(vide)\",\"\",ISBLANK(B87),\"\",B87)","v":0},0,0,null,null,"","","",""]
[null,null,null,null,null,"",{"$f":"_xlfn.SWITCH(B88,\"(vide)\",\"\",ISBLANK(B88),\"\",B88)","v":0},0,0,null,null,"","","",""]
[null,null,null,null,null,"",{"$f":"_xlfn.SWITCH(B89,\"(vide)\",\"\",ISBLANK(B89),\"\",B89)","v":0},0,0,null,null,"","","",""]
[null,null,null,null,null,"",{"$f":"_xlfn.SWITCH(B90,\"(vide)\",\"\",ISBLANK(B90),\"\",B90)","v":0},0,0,null,null,"","","",""]
[null,null,null,null,null,"",{"$f":"_xlfn.SWITCH(B91,\"(vide)\",\"\",ISBLANK(B91),\"\",B91)","v":0},0,0,null,null,"","","",""]
[null,null,null,null,null,"",{"$f":"_xlfn.SWITCH(B92,\"(vide)\",\"\",ISBLANK(B92),\"\",B92)","v":0},0,0,null,null,"","","",""]
[null,null,null,null,null,"",{"$f":"_xlfn.SWITCH(B93,\"(vide)\",\"\",ISBLANK(B93),\"\",B93)","v":0},0,0,null,null,"","","",""]
[null,null,null,null,null,"",{"$f":"_xlfn.SWITCH(B94,\"(vide)\",\"\",ISBLANK(B94),\"\",B94)","v":0},0,0,null,null,"","","",""]
[null,null,null,null,null,"",{"$f":"_xlfn.SWITCH(B95,\"(vide)\",\"\",ISBLANK(B95),\"\",B95)","v":0},0,0,null,null,"","","",""]
[null,null,null,null,null,"",{"$f":"_xlfn.SWITCH(B96,\"(vide)\",\"\",ISBLANK(B96),\"\",B96)","v":0},0,0,null,null,"","","",""]
[null,null,null,null,null,"",{"$f":"_xlfn.SWITCH(B97,\"(vide)\",\"\",ISBLANK(B97),\"\",B97)","v":0},0,0,null,null,"","","",""]
[null,null,null,null,null,"",{"$f":"_xlfn.SWITCH(B98,\"(vide)\",\"\",ISBLANK(B98),\"\",B98)","v":0},0,0,null,null,"","","",""]
[null,null,null,null,null,"",{"$f":"_xlfn.SWITCH(B99,\"(vide)\",\"\",ISBLANK(B99),\"\",B99)","v":0},0,0,null,null,"","","",""]
[null,null,null,null,null,"",{"$f":"_xlfn.SWITCH(B100,\"(vide)\",\"\",ISBLANK(B100),\"\",B100)","v":0},0,0,null,null,"","","",""]
[null,null,null,null,null,"",{"$f":"_xlfn.SWITCH(B101,\"(vide)\",\"\",ISBLANK(B101),\"\",B101)","v":0},0,0,null,null,"","","",""]
[null,null,null,null,null,"",{"$f":"_xlfn.SWITCH(B102,\"(vide)\",\"\",ISBLANK(B102),\"\",B102)","v":0},0,0,null,null,"","","",""]
[null,null,null,null,null,"",{"$f":"_xlfn.SWITCH(B103,\"(vide)\",\"\",ISBLANK(B103),\"\",B103)","v":0},0,0,null,null,"","","",""]
[null,null,null,null,null,"",{"$f":"_xlfn.SWITCH(B104,\"(vide)\",\"\",ISBLANK(B104),\"\",B104)","v":0},0,0,null,null,"","","",""]
[null,null,null,null,null,"",{"$f":"_xlfn.SWITCH(B105,\"(vide)\",\"\",ISBLANK(B105),\"\",B105)","v":0},0,0,null,null,"","","",""]
[null,null,null,null,null,"",{"$f":"_xlfn.SWITCH(B106,\"(vide)\",\"\",ISBLANK(B106),\"\",B106)","v":0},0,0,null,null,"","","",""]
[null,null,null,null,null,"",{"$f":"_xlfn.SWITCH(B107,\"(vide)\",\"\",ISBLANK(B107),\"\",B107)","v":0},0,0,null,null,"","","",""]
[null,null,null,null,null,"",{"$f":"_xlfn.SWITCH(B108,\"(vide)\",\"\",ISBLANK(B108),\"\",B108)","v":0},0,0,null,null,"","","",""]
[null,null,null,null,null,"",{"$f":"_xlfn.SWITCH(B109,\"(vide)\",\"\",ISBLANK(B109),\"\",B109)","v":0},0,0,null,null,"","","",""]
[null,null,null,null,null,"",{"$f":"_xlfn.SWITCH(B110,\"(vide)\",\"\",ISBLANK(B110),\"\",B110)","v":0},0,0,null,null,"","","",""]
[null,null,null,null,null,"",{"$f":"_xlfn.SWITCH(B111,\"(vide)\",\"\",ISBLANK(B111),\"\",B111)","v":0},0,0,null,null,"","","",""]
[null,null,null,null,null,"",{"$f":"_xlfn.SWITCH(B112,\"(vide)\",\"\",ISBLANK(B112),\"\",B112)","v":0},0,0,null,null,"","","",""]
[null,null,null,null,null,"",{"$f":"_xlfn.SWITCH(B113,\"(vide)\",\"\",ISBLANK(B113),\"\",B113)","v":0},0,0,null,null,"","","",""]
[null,null,null,null,null,"",{"$f":"_xlfn.SWITCH(B114,\"(vide)\",\"\",ISBLANK(B114),\"\",B114)","v":0},0,0,null,null,"","","",""]
[null,null,null,null,null,"",{"$f":"_xlfn.SWITCH(B115,\"(vide)\",\"\",ISBLANK(B115),\"\",B115)","v":0},0,0,null,null,"","","",""]
[null,null,null,null,null,"",{"$f":"_xlfn.SWITCH(B116,\"(vide)\",\"\",ISBLANK(B116),\"\",B116)","v":0},0,0,null,null,"","","",""]
[null,null,null,null,null,"",{"$f":"_xlfn.SWITCH(B117,\"(vide)\",\"\",ISBLANK(B117),\"\",B117)","v":0},0,0,null,null,"","","",""]
[null,null,null,null,null,"",{"$f":"_xlfn.SWITCH(B118,\"(vide)\",\"\",ISBLANK(B118),\"\",B118)","v":0},0,0,null,null,"","","",""]
[null,null,null,null,null,"",{"$f":"_xlfn.SWITCH(B119,\"(vide)\",\"\",ISBLANK(B119),\"\",B119)","v":0},0,0,null,null,"","","",""]
[null,null,null,null,null,"",{"$f":"_xlfn.SWITCH(B120,\"(vide)\",\"\",ISBLANK(B120),\"\",B120)","v":0},0,0,null,null,"","","",""]
[null,null,null,null,null,"",{"$f":"_xlfn.SWITCH(B121,\"(vide)\",\"\",ISBLANK(B121),\"\",B121)","v":0},0,0,null,null,"","","",""]
[null,null,null,null,null,"",{"$f":"_xlfn.SWITCH(B122,\"(vide)\",\"\",ISBLANK(B122),\"\",B122)","v":0},0,0,null,null,"","","",""]
[null,null,null,null,null,"",{"$f":"_xlfn.SWITCH(B123,\"(vide)\",\"\",ISBLANK(B123),\"\",B123)","v":0},0,0,null,null,"","","",""]
[null,null,null,null,null,"",{"$f":"_xlfn.SWITCH(B124,\"(vide)\",\"\",ISBLANK(B124),\"\",B124)","v":0},0,0,null,null,"","","",""]
[null,null,null,null,null,"",{"$f":"_xlfn.SWITCH(B125,\"(vide)\",\"\",ISBLANK(B125),\"\",B125)","v":0},0,0,null,null,"","","",""]
[null,null,null,null,null,"",{"$f":"_xlfn.SWITCH(B126,\"(vide)\",\"\",ISBLANK(B126),\"\",B126)","v":0},0,0,null,null,"","","",""]
[null,null,null,null,null,"",{"$f":"_xlfn.SWITCH(B127,\"(vide)\",\"\",ISBLANK(B127),\"\",B127)","v":0},0,0,null,null,"","","",""]
[null,null,null,null,null,"",{"$f":"_xlfn.SWITCH(B128,\"(vide)\",\"\",ISBLANK(B128),\"\",B128)","v":0},0,0,null,null,"","","",""]
[null,null,null,null,null,"",{"$f":"_xlfn.SWITCH(B129,\"(vide)\",\"\",ISBLANK(B129),\"\",B129)","v":0},0,0,null,null,"","","",""]
[null,null,null,null,null,"",{"$f":"_xlfn.SWITCH(B130,\"(vide)\",\"\",ISBLANK(B130),\"\",B130)","v":0},0,0,null,null,"","","",""]
[null,null,null,null,null,{"$f":"IF(A131=\"\",\"\",A131)","v":""},{"$f":"_xlfn.SWITCH(B131,\"(vide)\",\"\",ISBLANK(B131),\"\",B131)","v":0},0,0,null,null,"","","",""]
[null,null,null,null,null,"",{"$f":"_xlfn.SWITCH(B132,\"(vide)\",\"\",ISBLANK(B132),\"\",B132)","v":0},0,0,null,null,{"$f":"IF(F132=0,\"\",F132)","v":""},"","",""]
[null,null,null,null,null,"",{"$f":"_xlfn.SWITCH(B133,\"(vide)\",\"\",ISBLANK(B133),\"\",B133)","v":0},0,0,null,null,"","","",""]
[null,null,null,null,null,"",{"$f":"_xlfn.SWITCH(B134,\"(vide)\",\"\",ISBLANK(B134),\"\",B134)","v":0},0,0,null,null,"","","",""]
[null,null,null,null,null,"",{"$f":"_xlfn.SWITCH(B135,\"(vide)\",\"\",ISBLANK(B135),\"\",B135)","v":0},0,0,null,null,"","","",""]
[null,null,null,null,null,"",{"$f":"_xlfn.SWITCH(B136,\"(vide)\",\"\",ISBLANK(B136),\"\",B136)","v":0},0,0,null,null,"","","",""]
[null,null,null,null,null,"",{"$f":"_xlfn.SWITCH(B137,\"(vide)\",\"\",ISBLANK(B137),\"\",B137)","v":0},0,0,null,null,"","","",""]
[null,null,null,null,null,"",{"$f":"_xlfn.SWITCH(B138,\"(vide)\",\"\",ISBLANK(B138),\"\",B138)","v":0},0,0,null,null,"","","",""]
[null,null,null,null,null,"",{"$f":"_xlfn.SWITCH(B139,\"(vide)\",\"\",ISBLANK(B139),\"\",B139)","v":0},0,0,null,null,"","","",""]
[null,null,null,null,null,"",{"$f":"_xlfn.SWITCH(B140,\"(vide)\",\"\",ISBLANK(B140),\"\",B140)","v":0},0,0,null,null,"","","",""]
[null,null,null,null,null,"",{"$f":"_xlfn.SWITCH(B141,\"(vide)\",\"\",ISBLANK(B141),\"\",B141)","v":0},0,0,null,null,"","","",""]
[null,null,null,null,null,"",{"$f":"_xlfn.SWITCH(B142,\"(vide)\",\"\",ISBLANK(B142),\"\",B142)","v":0},0,0,null,null,"","","",""]

{"sheet":"NA","index":24,"n_rows":1,"n_cols":1,"rows_kept":1,"cut":false,"hidden":false,"merged":[[0,0,2,22]]}
["REGION\nNOUVELLE AQUITAINE"]

{"sheet":"PACA TCD","index":25,"n_rows":142,"n_cols":15,"rows_kept":142,"cut":false,"hidden":true,"merged":[]}
["Pays","Provinces","Départements","CENTRE",null,{"$f":"A1","v":"Pays"},{"$f":"B1","v":"Provinces"},{"$f":"C1","v":"Départements"},"CENTRE",null,null,{"$f":"IF(F1=0,\"\",F1)","v":"Pays"},"Provinces","Départements","CENTRE"]
["France","Provence-Alpes-Côte d'Azur","Alpes-Maritimes","Nice",null,{"$f":"IF(A2=\"\",\"\",A2)","v":"France"},{"$f":"IF(B2=\"(vide)\",\"\",B2)","v":"Provence-Alpes-Côte d'Azur"},"Alpes-Maritimes","Nice",null,null,"France","Provence-Alpes-Côte d'Azur","Alpes-Maritimes","Nice"]
["France","Provence-Alpes-Côte d'Azur","Bouches-du-Rhône","Istres",null,{"$f":"IF(A3=\"\",\"\",A3)","v":"France"},{"$f":"IF(B3=\"(vide)\",\"\",B3)","v":"Provence-Alpes-Côte d'Azur"},"Bouches-du-Rhône","Istres",null,null,{"$f":"IF(F3=0,\"\",F3)","v":"France"},{"$f":"IF(G3=0,\"\",G3)","v":"Provence-Alpes-Côte d'Azur"},{"$f":"IF(H3=0,\"\",H3)","v":"Bouches-du-Rhône"},{"$f":"IF(I3=0,\"\",I3)","v":"Istres"}]
["France","Provence-Alpes-Côte d'Azur","Bouches-du-Rhône","Marseille la Treille",null,"France","Provence-Alpes-Côte d'Azur","Bouches-du-Rhône","Marseille la Treille",null,null,{"$f":"IF(F4=0,\"\",F4)","v":"France"},"Provence-Alpes-Côte d'Azur","Bouches-du-Rhône","Marseille la Treille"]
["France","Provence-Alpes-Côte d'Azur","Bouches-du-Rhône","Marseille Pointe Rouge",null,"France",{"$f":"_xlfn.SWITCH(B5,\"(vide)\",\"\",ISBLANK(B5),\"\",B5)","v":"Provence-Alpes-Côte d'Azur"},"Bouches-du-Rhône","Marseille Pointe Rouge",null,null,"France","Provence-Alpes-Côte d'Azur","Bouches-du-Rhône","Marseille Pointe Rouge"]
["France","Provence-Alpes-Côte d'Azur","Bouches-du-Rhône","Marseille St Jérôme",null,"France",{"$f":"_xlfn.SWITCH(B6,\"(vide)\",\"\",ISBLANK(B6),\"\",B6)","v":"Provence-Alpes-Côte d'Azur"},"Bouches-du-Rhône","Marseille St Jérôme",null,null,"France","Provence-Alpes-Côte d'Azur","Bouches-du-Rhône","Marseille St Jérôme"]
["France","Provence-Alpes-Côte d'Azur","Hautes-Alpes","Gap",null,"France",{"$f":"_xlfn.SWITCH(B7,\"(vide)\",\"\",ISBLANK(B7),\"\",B7)","v":"Provence-Alpes-Côte d'Azur"},"Hautes-Alpes","Gap",null,null,"France","Provence-Alpes-Côte d'Azur","Hautes-Alpes","Gap"]
["France","Provence-Alpes-Côte d'Azur","Var","Toulon La Valette",null,"France",{"$f":"_xlfn.SWITCH(B8,\"(vide)\",\"\",ISBLANK(B8),\"\",B8)","v":"Provence-Alpes-Côte d'Azur"},"Var","Toulon La Valette",null,null,"France","Provence-Alpes-Côte d'Azur","Var","Toulon La Valette"]
["France","Provence-Alpes-Côte d'Azur","Vaucluse","Avignon Le Pontet",null,"France",{"$f":"_xlfn.SWITCH(B9,\"(vide)\",\"\",ISBLANK(B9),\"\",B9)","v":"Provence-Alpes-Côte d'Azur"},"Vaucluse","Avignon Le Pontet",null,null,"France","Provence-Alpes-Côte d'Azur","Vaucluse","Avignon Le Pontet"]
[null,null,null,null,null,"",{"$f":"_xlfn.SWITCH(B10,\"(vide)\",\"\",ISBLANK(B10),\"\",B10)","v":0},0,0,null,null,"","","",""]
[null,null,null,null,null,"",{"$f":"_xlfn.SWITCH(B11,\"(vide)\",\"\",ISBLANK(B11),\"\",B11)","v":0},0,0,null,null,"","","",""]
[null,null,null,null,null,"",{"$f":"_xlfn.SWITCH(B12,\"(vide)\",\"\",ISBLANK(B12),\"\",B12)","v":0},0,0,null,null,"","","",""]
[null,null,null,null,null,"",{"$f":"_xlfn.SWITCH(B13,\"(vide)\",\"\",ISBLANK(B13),\"\",B13)","v":0},0,0,null,null,"","","",""]
[null,null,null,null,null,"",{"$f":"_xlfn.SWITCH(B14,\"(vide)\",\"\",ISBLANK(B14),\"\",B14)","v":0},0,0,null,null,"","","",""]
[null,null,null,null,null,"",{"$f":"_xlfn.SWITCH(B15,\"(vide)\",\"\",ISBLANK(B15),\"\",B15)","v":0},0,0,null,null,"","","",""]
[null,null,null,null,null,"",{"$f":"_xlfn.SWITCH(B16,\"(vide)\",\"\",ISBLANK(B16),\"\",B16)","v":0},0,0,null,null,"","","",""]
[null,null,null,null,null,"",{"$f":"_xlfn.SWITCH(B17,\"(vide)\",\"\",ISBLANK(B17),\"\",B17)","v":0},{"$f":"C17","v":0},0,null,null,"","","",""]
[null,null,null,null,null,"",{"$f":"_xlfn.SWITCH(B18,\"(vide)\",\"\",ISBLANK(B18),\"\",B18)","v":0},0,0,null,null,"","","",""]
[null,null,null,null,null,"",{"$f":"_xlfn.SWITCH(B19,\"(vide)\",\"\",ISBLANK(B19),\"\",B19)","v":0},0,0,null,null,"","","",""]
[null,null,null,null,null,"",{"$f":"_xlfn.SWITCH(B20,\"(vide)\",\"\",ISBLANK(B20),\"\",B20)","v":0},0,0,null,null,"","","",""]
[null,null,null,null,null,"",{"$f":"_xlfn.SWITCH(B21,\"(vide)\",\"\",ISBLANK(B21),\"\",B21)","v":0},0,0,null,null,"","","",""]
[null,null,null,null,null,"",{"$f":"_xlfn.SWITCH(B22,\"(vide)\",\"\",ISBLANK(B22),\"\",B22)","v":0},0,0,null,null,"","","",""]
[null,null,null,null,null,"",{"$f":"_xlfn.SWITCH(B23,\"(vide)\",\"\",ISBLANK(B23),\"\",B23)","v":0},0,0,null,null,"","","",""]
[null,null,null,null,null,"",{"$f":"_xlfn.SWITCH(B24,\"(vide)\",\"\",ISBLANK(B24),\"\",B24)","v":0},0,0,null,null,"","","",""]
[null,null,null,null,null,"",{"$f":"_xlfn.SWITCH(B25,\"(vide)\",\"\",ISBLANK(B25),\"\",B25)","v":0},0,0,null,null,"","","",""]
[null,null,null,null,null,"",{"$f":"_xlfn.SWITCH(B26,\"(vide)\",\"\",ISBLANK(B26),\"\",B26)","v":0},0,0,null,null,"","","",""]
[null,null,null,null,null,"",{"$f":"_xlfn.SWITCH(B27,\"(vide)\",\"\",ISBLANK(B27),\"\",B27)","v":0},0,0,null,null,"","","",""]
[null,null,null,null,null,"",{"$f":"_xlfn.SWITCH(B28,\"(vide)\",\"\",ISBLANK(B28),\"\",B28)","v":0},0,0,null,null,"","","",""]
[null,null,null,null,null,"",{"$f":"_xlfn.SWITCH(B29,\"(vide)\",\"\",ISBLANK(B29),\"\",B29)","v":0},0,0,null,null,"","","",""]
[null,null,null,null,null,"",{"$f":"_xlfn.SWITCH(B30,\"(vide)\",\"\",ISBLANK(B30),\"\",B30)","v":0},0,0,null,null,"","","",""]
[null,null,null,null,null,"",{"$f":"_xlfn.SWITCH(B31,\"(vide)\",\"\",ISBLANK(B31),\"\",B31)","v":0},0,0,null,null,"","","",""]
[null,null,null,null,null,"",{"$f":"_xlfn.SWITCH(B32,\"(vide)\",\"\",ISBLANK(B32),\"\",B32)","v":0},0,0,null,null,"","","",""]
[null,null,null,null,null,"",{"$f":"_xlfn.SWITCH(B33,\"(vide)\",\"\",ISBLANK(B33),\"\",B33)","v":0},0,0,null,null,"","","",""]
[null,null,null,null,null,"",{"$f":"_xlfn.SWITCH(B34,\"(vide)\",\"\",ISBLANK(B34),\"\",B34)","v":0},0,0,null,null,"","","",""]
[null,null,null,null,null,"",{"$f":"_xlfn.SWITCH(B35,\"(vide)\",\"\",ISBLANK(B35),\"\",B35)","v":0},0,0,null,null,"","","",""]
[null,null,null,null,null,"",{"$f":"_xlfn.SWITCH(B36,\"(vide)\",\"\",ISBLANK(B36),\"\",B36)","v":0},0,0,null,null,"","","",""]
[null,null,null,null,null,"",{"$f":"_xlfn.SWITCH(B37,\"(vide)\",\"\",ISBLANK(B37),\"\",B37)","v":0},0,0,null,null,"","","",""]
[null,null,null,null,null,"",{"$f":"_xlfn.SWITCH(B38,\"(vide)\",\"\",ISBLANK(B38),\"\",B38)","v":0},0,0,null,null,"","","",""]
[null,null,null,null,null,"",{"$f":"_xlfn.SWITCH(B39,\"(vide)\",\"\",ISBLANK(B39),\"\",B39)","v":0},0,0,null,null,"","","",""]
[null,null,null,null,null,"",{"$f":"_xlfn.SWITCH(B40,\"(vide)\",\"\",ISBLANK(B40),\"\",B40)","v":0},0,0,null,null,"","","",""]
[null,null,null,null,null,"",{"$f":"_xlfn.SWITCH(B41,\"(vide)\",\"\",ISBLANK(B41),\"\",B41)","v":0},0,0,null,null,"","","",""]
[null,null,null,null,null,"",{"$f":"_xlfn.SWITCH(B42,\"(vide)\",\"\",ISBLANK(B42),\"\",B42)","v":0},0,0,null,null,"","","",""]
[null,null,null,null,null,"",{"$f":"_xlfn.SWITCH(B43,\"(vide)\",\"\",ISBLANK(B43),\"\",B43)","v":0},0,0,null,null,"","","",""]
[null,null,null,null,null,"",{"$f":"_xlfn.SWITCH(B44,\"(vide)\",\"\",ISBLANK(B44),\"\",B44)","v":0},0,0,null,null,"","","",""]
[null,null,null,null,null,"",{"$f":"_xlfn.SWITCH(B45,\"(vide)\",\"\",ISBLANK(B45),\"\",B45)","v":0},0,0,null,null,"","","",""]
[null,null,null,null,null,"",{"$f":"_xlfn.SWITCH(B46,\"(vide)\",\"\",ISBLANK(B46),\"\",B46)","v":0},0,0,null,null,"","","",""]
[null,null,null,null,null,"",{"$f":"_xlfn.SWITCH(B47,\"(vide)\",\"\",ISBLANK(B47),\"\",B47)","v":0},0,0,null,null,"","","",""]
[null,null,null,null,null,"",{"$f":"_xlfn.SWITCH(B48,\"(vide)\",\"\",ISBLANK(B48),\"\",B48)","v":0},0,0,null,null,"","","",""]
[null,null,null,null,null,"",{"$f":"_xlfn.SWITCH(B49,\"(vide)\",\"\",ISBLANK(B49),\"\",B49)","v":0},0,0,null,null,"","","",""]
[null,null,null,null,null,"",{"$f":"_xlfn.SWITCH(B50,\"(vide)\",\"\",ISBLANK(B50),\"\",B50)","v":0},0,0,null,null,"","","",""]
[null,null,null,null,null,"",{"$f":"_xlfn.SWITCH(B51,\"(vide)\",\"\",ISBLANK(B51),\"\",B51)","v":0},0,0,null,null,"","","",""]
[null,null,null,null,null,"",{"$f":"_xlfn.SWITCH(B52,\"(vide)\",\"\",ISBLANK(B52),\"\",B52)","v":0},0,0,null,null,"","","",""]
[null,null,null,null,null,"",{"$f":"_xlfn.SWITCH(B53,\"(vide)\",\"\",ISBLANK(B53),\"\",B53)","v":0},0,0,null,null,"","","",""]
[null,null,null,null,null,"",{"$f":"_xlfn.SWITCH(B54,\"(vide)\",\"\",ISBLANK(B54),\"\",B54)","v":0},0,0,null,null,"","","",""]
[null,null,null,null,null,"",{"$f":"_xlfn.SWITCH(B55,\"(vide)\",\"\",ISBLANK(B55),\"\",B55)","v":0},0,0,null,null,"","","",""]
[null,null,null,null,null,"",{"$f":"_xlfn.SWITCH(B56,\"(vide)\",\"\",ISBLANK(B56),\"\",B56)","v":0},0,0,null,null,"","","",""]
[null,null,null,null,null,"",{"$f":"_xlfn.SWITCH(B57,\"(vide)\",\"\",ISBLANK(B57),\"\",B57)","v":0},0,0,null,null,"","","",""]
[null,null,null,null,null,"",{"$f":"_xlfn.SWITCH(B58,\"(vide)\",\"\",ISBLANK(B58),\"\",B58)","v":0},0,0,null,null,"","","",""]
[null,null,null,null,null,"",{"$f":"_xlfn.SWITCH(B59,\"(vide)\",\"\",ISBLANK(B59),\"\",B59)","v":0},0,0,null,null,"","","",""]
[null,null,null,null,null,"",{"$f":"_xlfn.SWITCH(B60,\"(vide)\",\"\",ISBLANK(B60),\"\",B60)","v":0},0,0,null,null,"","","",""]
[null,null,null,null,null,"",{"$f":"_xlfn.SWITCH(B61,\"(vide)\",\"\",ISBLANK(B61),\"\",B61)","v":0},0,0,null,null,"","","",""]
[null,null,null,null,null,"",{"$f":"_xlfn.SWITCH(B62,\"(vide)\",\"\",ISBLANK(B62),\"\",B62)","v":0},0,0,null,null,"","","",""]
[null,null,null,null,null,"",{"$f":"_xlfn.SWITCH(B63,\"(vide)\",\"\",ISBLANK(B63),\"\",B63)","v":0},0,0,null,null,"","","",""]
[null,null,null,null,null,"",{"$f":"_xlfn.SWITCH(B64,\"(vide)\",\"\",ISBLANK(B64),\"\",B64)","v":0},0,0,null,null,"","","",""]
[null,null,null,null,null,"",{"$f":"_xlfn.SWITCH(B65,\"(vide)\",\"\",ISBLANK(B65),\"\",B65)","v":0},0,0,null,null,"","","",""]
[null,null,null,null,null,"",{"$f":"_xlfn.SWITCH(B66,\"(vide)\",\"\",ISBLANK(B66),\"\",B66)","v":0},0,0,null,null,"","","",""]
[null,null,null,null,null,{"$f":"IF(A67=\"\",\"\",A67)","v":""},{"$f":"_xlfn.SWITCH(B67,\"(vide)\",\"\",ISBLANK(B67),\"\",B67)","v":0},0,0,null,null,"","","",{"$f":"IF(I67=0,\"\",I67)","v":""}]
[null,null,null,null,null,"",{"$f":"_xlfn.SWITCH(B68,\"(vide)\",\"\",ISBLANK(B68),\"\",B68)","v":0},0,0,null,null,{"$f":"IF(F68=0,\"\",F68)","v":""},"","",""]
[null,null,null,null,null,"",{"$f":"_xlfn.SWITCH(B69,\"(vide)\",\"\",ISBLANK(B69),\"\",B69)","v":0},0,0,null,null,"","","",""]
[null,null,null,null,null,"",{"$f":"_xlfn.SWITCH(B70,\"(vide)\",\"\",ISBLANK(B70),\"\",B70)","v":0},0,0,null,null,"","","",""]
[null,null,null,null,null,"",{"$f":"_xlfn.SWITCH(B71,\"(vide)\",\"\",ISBLANK(B71),\"\",B71)","v":0},0,0,null,null,"","","",""]
[null,null,null,null,null,"",{"$f":"_xlfn.SWITCH(B72,\"(vide)\",\"\",ISBLANK(B72),\"\",B72)","v":0},0,0,null,null,"","","",""]
[null,null,null,null,null,"",{"$f":"_xlfn.SWITCH(B73,\"(vide)\",\"\",ISBLANK(B73),\"\",B73)","v":0},0,0,null,null,"","","",""]
[null,null,null,null,null,"",{"$f":"_xlfn.SWITCH(B74,\"(vide)\",\"\",ISBLANK(B74),\"\",B74)","v":0},0,0,null,null,"","","",""]
[null,null,null,null,null,"",{"$f":"_xlfn.SWITCH(B75,\"(vide)\",\"\",ISBLANK(B75),\"\",B75)","v":0},0,0,null,null,"","","",""]
[null,null,null,null,null,"",{"$f":"_xlfn.SWITCH(B76,\"(vide)\",\"\",ISBLANK(B76),\"\",B76)","v":0},0,0,null,null,"","","",""]
[null,null,null,null,null,"",{"$f":"_xlfn.SWITCH(B77,\"(vide)\",\"\",ISBLANK(B77),\"\",B77)","v":0},0,0,null,null,"","","",""]
[null,null,null,null,null,"",{"$f":"_xlfn.SWITCH(B78,\"(vide)\",\"\",ISBLANK(B78),\"\",B78)","v":0},0,0,null,null,"","","",""]
[null,null,null,null,null,"",{"$f":"_xlfn.SWITCH(B79,\"(vide)\",\"\",ISBLANK(B79),\"\",B79)","v":0},0,0,null,null,"","","",""]
[null,null,null,null,null,"",{"$f":"_xlfn.SWITCH(B80,\"(vide)\",\"\",ISBLANK(B80),\"\",B80)","v":0},0,0,null,null,"","","",""]
[null,null,null,null,null,"",{"$f":"_xlfn.SWITCH(B81,\"(vide)\",\"\",ISBLANK(B81),\"\",B81)","v":0},{"$f":"C81","v":0},0,null,null,"","","",""]
[null,null,null,null,null,"",{"$f":"_xlfn.SWITCH(B82,\"(vide)\",\"\",ISBLANK(B82),\"\",B82)","v":0},0,0,null,null,"","","",""]
[null,null,null,null,null,"",{"$f":"_xlfn.SWITCH(B83,\"(vide)\",\"\",ISBLANK(B83),\"\",B83)","v":0},0,0,null,null,"","","",""]
[null,null,null,null,null,"",{"$f":"_xlfn.SWITCH(B84,\"(vide)\",\"\",ISBLANK(B84),\"\",B84)","v":0},0,0,null,null,"","","",""]
[null,null,null,null,null,"",{"$f":"_xlfn.SWITCH(B85,\"(vide)\",\"\",ISBLANK(B85),\"\",B85)","v":0},0,0,null,null,"","","",""]
[null,null,null,null,null,"",{"$f":"_xlfn.SWITCH(B86,\"(vide)\",\"\",ISBLANK(B86),\"\",B86)","v":0},0,0,null,null,"","","",""]
[null,null,null,null,null,"",{"$f":"_xlfn.SWITCH(B87,\"(vide)\",\"\",ISBLANK(B87),\"\",B87)","v":0},0,0,null,null,"","","",""]
[null,null,null,null,null,"",{"$f":"_xlfn.SWITCH(B88,\"(vide)\",\"\",ISBLANK(B88),\"\",B88)","v":0},0,0,null,null,"","","",""]
[null,null,null,null,null,"",{"$f":"_xlfn.SWITCH(B89,\"(vide)\",\"\",ISBLANK(B89),\"\",B89)","v":0},0,0,null,null,"","","",""]
[null,null,null,null,null,"",{"$f":"_xlfn.SWITCH(B90,\"(vide)\",\"\",ISBLANK(B90),\"\",B90)","v":0},0,0,null,null,"","","",""]
[null,null,null,null,null,"",{"$f":"_xlfn.SWITCH(B91,\"(vide)\",\"\",ISBLANK(B91),\"\",B91)","v":0},0,0,null,null,"","","",""]
[null,null,null,null,null,"",{"$f":"_xlfn.SWITCH(B92,\"(vide)\",\"\",ISBLANK(B92),\"\",B92)","v":0},0,0,null,null,"","","",""]
[null,null,null,null,null,"",{"$f":"_xlfn.SWITCH(B93,\"(vide)\",\"\",ISBLANK(B93),\"\",B93)","v":0},0,0,null,null,"","","",""]
[null,null,null,null,null,"",{"$f":"_xlfn.SWITCH(B94,\"(vide)\",\"\",ISBLANK(B94),\"\",B94)","v":0},0,0,null,null,"","","",""]
[null,null,null,null,null,"",{"$f":"_xlfn.SWITCH(B95,\"(vide)\",\"\",ISBLANK(B95),\"\",B95)","v":0},0,0,null,null,"","","",""]
[null,null,null,null,null,"",{"$f":"_xlfn.SWITCH(B96,\"(vide)\",\"\",ISBLANK(B96),\"\",B96)","v":0},0,0,null,null,"","","",""]
[null,null,null,null,null,"",{"$f":"_xlfn.SWITCH(B97,\"(vide)\",\"\",ISBLANK(B97),\"\",B97)","v":0},0,0,null,null,"","","",""]
[null,null,null,null,null,"",{"$f":"_xlfn.SWITCH(B98,\"(vide)\",\"\",ISBLANK(B98),\"\",B98)","v":0},0,0,null,null,"","","",""]
[null,null,null,null,null,"",{"$f":"_xlfn.SWITCH(B99,\"(vide)\",\"\",ISBLANK(B99),\"\",B99)","v":0},0,0,null,null,"","","",""]
[null,null,null,null,null,"",{"$f":"_xlfn.SWITCH(B100,\"(vide)\",\"\",ISBLANK(B100),\"\",B100)","v":0},0,0,null,null,"","","",""]
[null,null,null,null,null,"",{"$f":"_xlfn.SWITCH(B101,\"(vide)\",\"\",ISBLANK(B101),\"\",B101)","v":0},0,0,null,null,"","","",""]
[null,null,null,null,null,"",{"$f":"_xlfn.SWITCH(B102,\"(vide)\",\"\",ISBLANK(B102),\"\",B102)","v":0},0,0,null,null,"","","",""]
[null,null,null,null,null,"",{"$f":"_xlfn.SWITCH(B103,\"(vide)\",\"\",ISBLANK(B103),\"\",B103)","v":0},0,0,null,null,"","","",""]
[null,null,null,null,null,"",{"$f":"_xlfn.SWITCH(B104,\"(vide)\",\"\",ISBLANK(B104),\"\",B104)","v":0},0,0,null,null,"","","",""]
[null,null,null,null,null,"",{"$f":"_xlfn.SWITCH(B105,\"(vide)\",\"\",ISBLANK(B105),\"\",B105)","v":0},0,0,null,null,"","","",""]
[null,null,null,null,null,"",{"$f":"_xlfn.SWITCH(B106,\"(vide)\",\"\",ISBLANK(B106),\"\",B106)","v":0},0,0,null,null,"","","",""]
[null,null,null,null,null,"",{"$f":"_xlfn.SWITCH(B107,\"(vide)\",\"\",ISBLANK(B107),\"\",B107)","v":0},0,0,null,null,"","","",""]
[null,null,null,null,null,"",{"$f":"_xlfn.SWITCH(B108,\"(vide)\",\"\",ISBLANK(B108),\"\",B108)","v":0},0,0,null,null,"","","",""]
[null,null,null,null,null,"",{"$f":"_xlfn.SWITCH(B109,\"(vide)\",\"\",ISBLANK(B109),\"\",B109)","v":0},0,0,null,null,"","","",""]
[null,null,null,null,null,"",{"$f":"_xlfn.SWITCH(B110,\"(vide)\",\"\",ISBLANK(B110),\"\",B110)","v":0},0,0,null,null,"","","",""]
[null,null,null,null,null,"",{"$f":"_xlfn.SWITCH(B111,\"(vide)\",\"\",ISBLANK(B111),\"\",B111)","v":0},0,0,null,null,"","","",""]
[null,null,null,null,null,"",{"$f":"_xlfn.SWITCH(B112,\"(vide)\",\"\",ISBLANK(B112),\"\",B112)","v":0},0,0,null,null,"","","",""]
[null,null,null,null,null,"",{"$f":"_xlfn.SWITCH(B113,\"(vide)\",\"\",ISBLANK(B113),\"\",B113)","v":0},0,0,null,null,"","","",""]
[null,null,null,null,null,"",{"$f":"_xlfn.SWITCH(B114,\"(vide)\",\"\",ISBLANK(B114),\"\",B114)","v":0},0,0,null,null,"","","",""]
[null,null,null,null,null,"",{"$f":"_xlfn.SWITCH(B115,\"(vide)\",\"\",ISBLANK(B115),\"\",B115)","v":0},0,0,null,null,"","","",""]
[null,null,null,null,null,"",{"$f":"_xlfn.SWITCH(B116,\"(vide)\",\"\",ISBLANK(B116),\"\",B116)","v":0},0,0,null,null,"","","",""]
[null,null,null,null,null,"",{"$f":"_xlfn.SWITCH(B117,\"(vide)\",\"\",ISBLANK(B117),\"\",B117)","v":0},0,0,null,null,"","","",""]
[null,null,null,null,null,"",{"$f":"_xlfn.SWITCH(B118,\"(vide)\",\"\",ISBLANK(B118),\"\",B118)","v":0},0,0,null,null,"","","",""]
[null,null,null,null,null,"",{"$f":"_xlfn.SWITCH(B119,\"(vide)\",\"\",ISBLANK(B119),\"\",B119)","v":0},0,0,null,null,"","","",""]
[null,null,null,null,null,"",{"$f":"_xlfn.SWITCH(B120,\"(vide)\",\"\",ISBLANK(B120),\"\",B120)","v":0},0,0,null,null,"","","",""]
[null,null,null,null,null,"",{"$f":"_xlfn.SWITCH(B121,\"(vide)\",\"\",ISBLANK(B121),\"\",B121)","v":0},0,0,null,null,"","","",""]
[null,null,null,null,null,"",{"$f":"_xlfn.SWITCH(B122,\"(vide)\",\"\",ISBLANK(B122),\"\",B122)","v":0},0,0,null,null,"","","",""]
[null,null,null,null,null,"",{"$f":"_xlfn.SWITCH(B123,\"(vide)\",\"\",ISBLANK(B123),\"\",B123)","v":0},0,0,null,null,"","","",""]
[null,null,null,null,null,"",{"$f":"_xlfn.SWITCH(B124,\"(vide)\",\"\",ISBLANK(B124),\"\",B124)","v":0},0,0,null,null,"","","",""]
[null,null,null,null,null,"",{"$f":"_xlfn.SWITCH(B125,\"(vide)\",\"\",ISBLANK(B125),\"\",B125)","v":0},0,0,null,null,"","","",""]
[null,null,null,null,null,"",{"$f":"_xlfn.SWITCH(B126,\"(vide)\",\"\",ISBLANK(B126),\"\",B126)","v":0},0,0,null,null,"","","",""]
[null,null,null,null,null,"",{"$f":"_xlfn.SWITCH(B127,\"(vide)\",\"\",ISBLANK(B127),\"\",B127)","v":0},0,0,null,null,"","","",""]
[null,null,null,null,null,"",{"$f":"_xlfn.SWITCH(B128,\"(vide)\",\"\",ISBLANK(B128),\"\",B128)","v":0},0,0,null,null,"","","",""]
[null,null,null,null,null,"",{"$f":"_xlfn.SWITCH(B129,\"(vide)\",\"\",ISBLANK(B129),\"\",B129)","v":0},0,0,null,null,"","","",""]
[null,null,null,null,null,"",{"$f":"_xlfn.SWITCH(B130,\"(vide)\",\"\",ISBLANK(B130),\"\",B130)","v":0},0,0,null,null,"","","",""]
[null,null,null,null,null,{"$f":"IF(A131=\"\",\"\",A131)","v":""},{"$f":"_xlfn.SWITCH(B131,\"(vide)\",\"\",ISBLANK(B131),\"\",B131)","v":0},0,0,null,null,"","","",""]
[null,null,null,null,null,"",{"$f":"_xlfn.SWITCH(B132,\"(vide)\",\"\",ISBLANK(B132),\"\",B132)","v":0},0,0,null,null,{"$f":"IF(F132=0,\"\",F132)","v":""},"","",""]
[null,null,null,null,null,"",{"$f":"_xlfn.SWITCH(B133,\"(vide)\",\"\",ISBLANK(B133),\"\",B133)","v":0},0,0,null,null,"","","",""]
[null,null,null,null,null,"",{"$f":"_xlfn.SWITCH(B134,\"(vide)\",\"\",ISBLANK(B134),\"\",B134)","v":0},0,0,null,null,"","","",""]
[null,null,null,null,null,"",{"$f":"_xlfn.SWITCH(B135,\"(vide)\",\"\",ISBLANK(B135),\"\",B135)","v":0},0,0,null,null,"","","",""]
[null,null,null,null,null,"",{"$f":"_xlfn.SWITCH(B136,\"(vide)\",\"\",ISBLANK(B136),\"\",B136)","v":0},0,0,null,null,"","","",""]
[null,null,null,null,null,"",{"$f":"_xlfn.SWITCH(B137,\"(vide)\",\"\",ISBLANK(B137),\"\",B137)","v":0},0,0,null,null,"","","",""]
[null,null,null,null,null,"",{"$f":"_xlfn.SWITCH(B138,\"(vide)\",\"\",ISBLANK(B138),\"\",B138)","v":0},0,0,null,null,"","","",""]
[null,null,null,null,null,"",{"$f":"_xlfn.SWITCH(B139,\"(vide)\",\"\",ISBLANK(B139),\"\",B139)","v":0},0,0,null,null,"","","",""]
[null,null,null,null,null,"",{"$f":"_xlfn.SWITCH(B140,\"(vide)\",\"\",ISBLANK(B140),\"\",B140)","v":0},0,0,null,null,"","","",""]
[null,null,null,null,null,"",{"$f":"_xlfn.SWITCH(B141,\"(vide)\",\"\",ISBLANK(B141),\"\",B141)","v":0},0,0,null,null,"","","",""]
[null,null,null,null,null,"",{"$f":"_xlfn.SWITCH(B142,\"(vide)\",\"\",ISBLANK(B142),\"\",B142)","v":0},0,0,null,null,"","","",""]

{"sheet":"PACA","index":26,"n_rows":1,"n_cols":1,"rows_kept":1,"cut":false,"hidden":false,"merged":[[0,0,2,22]]}
["REGION\nPROVENCE ALPES COTE D'AZUR"]

{"sheet":"Occ TCD","index":27,"n_rows":142,"n_cols":15,"rows_kept":142,"cut":false,"hidden":true,"merged":[]}
["Pays","Provinces","Départements","CENTRE",null,{"$f":"A1","v":"Pays"},{"$f":"B1","v":"Provinces"},{"$f":"C1","v":"Départements"},"CENTRE",null,null,{"$f":"IF(F1=0,\"\",F1)","v":"Pays"},"Provinces","Départements","CENTRE"]
["France","Occitanie","Ariège","Foix",null,{"$f":"IF(A2=\"\",\"\",A2)","v":"France"},{"$f":"IF(B2=\"(vide)\",\"\",B2)","v":"Occitanie"},"Ariège","Foix",null,null,"France","Occitanie","Ariège","Foix"]
["France","Occitanie","Ariège","Pamiers",null,{"$f":"IF(A3=\"\",\"\",A3)","v":"France"},{"$f":"IF(B3=\"(vide)\",\"\",B3)","v":"Occitanie"},"Ariège","Pamiers",null,null,{"$f":"IF(F3=0,\"\",F3)","v":"France"},{"$f":"IF(G3=0,\"\",G3)","v":"Occitanie"},{"$f":"IF(H3=0,\"\",H3)","v":"Ariège"},{"$f":"IF(I3=0,\"\",I3)","v":"Pamiers"}]
["France","Occitanie","Aude","Carcassonne",null,"France","Occitanie","Aude","Carcassonne",null,null,{"$f":"IF(F4=0,\"\",F4)","v":"France"},"Occitanie","Aude","Carcassonne"]
["France","Occitanie","Aveyron","Rodez",null,"France",{"$f":"_xlfn.SWITCH(B5,\"(vide)\",\"\",ISBLANK(B5),\"\",B5)","v":"Occitanie"},"Aveyron","Rodez",null,null,"France","Occitanie","Aveyron","Rodez"]
["France","Occitanie","Gard","Alès",null,"France",{"$f":"_xlfn.SWITCH(B6,\"(vide)\",\"\",ISBLANK(B6),\"\",B6)","v":"Occitanie"},"Gard","Alès",null,null,"France","Occitanie","Gard","Alès"]
["France","Occitanie","Gard","Nîmes",null,"France",{"$f":"_xlfn.SWITCH(B7,\"(vide)\",\"\",ISBLANK(B7),\"\",B7)","v":"Occitanie"},"Gard","Nîmes",null,null,"France","Occitanie","Gard","Nîmes"]
["France","Occitanie","Haute-Garonne","Toulouse Balma",null,"France",{"$f":"_xlfn.SWITCH(B8,\"(vide)\",\"\",ISBLANK(B8),\"\",B8)","v":"Occitanie"},"Haute-Garonne","Toulouse Balma",null,null,"France","Occitanie","Haute-Garonne","Toulouse Balma"]
["France","Occitanie","Haute-Garonne","Toulouse Palays",null,"France",{"$f":"_xlfn.SWITCH(B9,\"(vide)\",\"\",ISBLANK(B9),\"\",B9)","v":"Occitanie"},"Haute-Garonne","Toulouse Palays",null,null,"France","Occitanie","Haute-Garonne","Toulouse Palays"]
["France","Occitanie","Hautes-Pyrénées","Tarbes",null,"France",{"$f":"_xlfn.SWITCH(B10,\"(vide)\",\"\",ISBLANK(B10),\"\",B10)","v":"Occitanie"},"Hautes-Pyrénées","Tarbes",null,null,"France","Occitanie","Hautes-Pyrénées","Tarbes"]
["France","Occitanie","Hérault","Béziers",null,"France",{"$f":"_xlfn.SWITCH(B11,\"(vide)\",\"\",ISBLANK(B11),\"\",B11)","v":"Occitanie"},"Hérault","Béziers",null,null,"France","Occitanie","Hérault","Béziers"]
["France","Occitanie","Hérault","Montpellier St Jean",null,"France",{"$f":"_xlfn.SWITCH(B12,\"(vide)\",\"\",ISBLANK(B12),\"\",B12)","v":"Occitanie"},"Hérault","Montpellier St Jean",null,null,"France","Occitanie","Hérault","Montpellier St Jean"]
["France","Occitanie","Pyrénées-Orientales","Perpignan Rivesaltes",null,"France",{"$f":"_xlfn.SWITCH(B13,\"(vide)\",\"\",ISBLANK(B13),\"\",B13)","v":"Occitanie"},"Pyrénées-Orientales","Perpignan Rivesaltes",null,null,"France","Occitanie","Pyrénées-Orientales","Perpignan Rivesaltes"]
["France","Occitanie","Tarn","Albi",null,"France",{"$f":"_xlfn.SWITCH(B14,\"(vide)\",\"\",ISBLANK(B14),\"\",B14)","v":"Occitanie"},"Tarn","Albi",null,null,"France","Occitanie","Tarn","Albi"]
["France","Occitanie","Tarn-et-Garonne","Montauban",null,"France",{"$f":"_xlfn.SWITCH(B15,\"(vide)\",\"\",ISBLANK(B15),\"\",B15)","v":"Occitanie"},"Tarn-et-Garonne","Montauban",null,null,"France","Occitanie","Tarn-et-Garonne","Montauban"]
["France","Occitanie","Lozère","Saint Chély d'Apcher",null,"France",{"$f":"_xlfn.SWITCH(B16,\"(vide)\",\"\",ISBLANK(B16),\"\",B16)","v":"Occitanie"},"Lozère","Saint Chély d'Apcher",null,null,"France","Occitanie","Lozère","Saint Chély d'Apcher"]
[null,null,null,null,null,"",{"$f":"_xlfn.SWITCH(B17,\"(vide)\",\"\",ISBLANK(B17),\"\",B17)","v":0},{"$f":"C17","v":0},0,null,null,"","","",""]
[null,null,null,null,null,"",{"$f":"_xlfn.SWITCH(B18,\"(vide)\",\"\",ISBLANK(B18),\"\",B18)","v":0},0,0,null,null,"","","",""]
[null,null,null,null,null,"",{"$f":"_xlfn.SWITCH(B19,\"(vide)\",\"\",ISBLANK(B19),\"\",B19)","v":0},0,0,null,null,"","","",""]
[null,null,null,null,null,"",{"$f":"_xlfn.SWITCH(B20,\"(vide)\",\"\",ISBLANK(B20),\"\",B20)","v":0},0,0,null,null,"","","",""]
[null,null,null,null,null,"",{"$f":"_xlfn.SWITCH(B21,\"(vide)\",\"\",ISBLANK(B21),\"\",B21)","v":0},0,0,null,null,"","","",""]
[null,null,null,null,null,"",{"$f":"_xlfn.SWITCH(B22,\"(vide)\",\"\",ISBLANK(B22),\"\",B22)","v":0},0,0,null,null,"","","",""]
[null,null,null,null,null,"",{"$f":"_xlfn.SWITCH(B23,\"(vide)\",\"\",ISBLANK(B23),\"\",B23)","v":0},0,0,null,null,"","","",""]
[null,null,null,null,null,"",{"$f":"_xlfn.SWITCH(B24,\"(vide)\",\"\",ISBLANK(B24),\"\",B24)","v":0},0,0,null,null,"","","",""]
[null,null,null,null,null,"",{"$f":"_xlfn.SWITCH(B25,\"(vide)\",\"\",ISBLANK(B25),\"\",B25)","v":0},0,0,null,null,"","","",""]
[null,null,null,null,null,"",{"$f":"_xlfn.SWITCH(B26,\"(vide)\",\"\",ISBLANK(B26),\"\",B26)","v":0},0,0,null,null,"","","",""]
[null,null,null,null,null,"",{"$f":"_xlfn.SWITCH(B27,\"(vide)\",\"\",ISBLANK(B27),\"\",B27)","v":0},0,0,null,null,"","","",""]
[null,null,null,null,null,"",{"$f":"_xlfn.SWITCH(B28,\"(vide)\",\"\",ISBLANK(B28),\"\",B28)","v":0},0,0,null,null,"","","",""]
[null,null,null,null,null,"",{"$f":"_xlfn.SWITCH(B29,\"(vide)\",\"\",ISBLANK(B29),\"\",B29)","v":0},0,0,null,null,"","","",""]
[null,null,null,null,null,"",{"$f":"_xlfn.SWITCH(B30,\"(vide)\",\"\",ISBLANK(B30),\"\",B30)","v":0},0,0,null,null,"","","",""]
[null,null,null,null,null,"",{"$f":"_xlfn.SWITCH(B31,\"(vide)\",\"\",ISBLANK(B31),\"\",B31)","v":0},0,0,null,null,"","","",""]
[null,null,null,null,null,"",{"$f":"_xlfn.SWITCH(B32,\"(vide)\",\"\",ISBLANK(B32),\"\",B32)","v":0},0,0,null,null,"","","",""]
[null,null,null,null,null,"",{"$f":"_xlfn.SWITCH(B33,\"(vide)\",\"\",ISBLANK(B33),\"\",B33)","v":0},0,0,null,null,"","","",""]
[null,null,null,null,null,"",{"$f":"_xlfn.SWITCH(B34,\"(vide)\",\"\",ISBLANK(B34),\"\",B34)","v":0},0,0,null,null,"","","",""]
[null,null,null,null,null,"",{"$f":"_xlfn.SWITCH(B35,\"(vide)\",\"\",ISBLANK(B35),\"\",B35)","v":0},0,0,null,null,"","","",""]
[null,null,null,null,null,"",{"$f":"_xlfn.SWITCH(B36,\"(vide)\",\"\",ISBLANK(B36),\"\",B36)","v":0},0,0,null,null,"","","",""]
[null,null,null,null,null,"",{"$f":"_xlfn.SWITCH(B37,\"(vide)\",\"\",ISBLANK(B37),\"\",B37)","v":0},0,0,null,null,"","","",""]
[null,null,null,null,null,"",{"$f":"_xlfn.SWITCH(B38,\"(vide)\",\"\",ISBLANK(B38),\"\",B38)","v":0},0,0,null,null,"","","",""]
[null,null,null,null,null,"",{"$f":"_xlfn.SWITCH(B39,\"(vide)\",\"\",ISBLANK(B39),\"\",B39)","v":0},0,0,null,null,"","","",""]
[null,null,null,null,null,"",{"$f":"_xlfn.SWITCH(B40,\"(vide)\",\"\",ISBLANK(B40),\"\",B40)","v":0},0,0,null,null,"","","",""]
[null,null,null,null,null,"",{"$f":"_xlfn.SWITCH(B41,\"(vide)\",\"\",ISBLANK(B41),\"\",B41)","v":0},0,0,null,null,"","","",""]
[null,null,null,null,null,"",{"$f":"_xlfn.SWITCH(B42,\"(vide)\",\"\",ISBLANK(B42),\"\",B42)","v":0},0,0,null,null,"","","",""]
[null,null,null,null,null,"",{"$f":"_xlfn.SWITCH(B43,\"(vide)\",\"\",ISBLANK(B43),\"\",B43)","v":0},0,0,null,null,"","","",""]
[null,null,null,null,null,"",{"$f":"_xlfn.SWITCH(B44,\"(vide)\",\"\",ISBLANK(B44),\"\",B44)","v":0},0,0,null,null,"","","",""]
[null,null,null,null,null,"",{"$f":"_xlfn.SWITCH(B45,\"(vide)\",\"\",ISBLANK(B45),\"\",B45)","v":0},0,0,null,null,"","","",""]
[null,null,null,null,null,"",{"$f":"_xlfn.SWITCH(B46,\"(vide)\",\"\",ISBLANK(B46),\"\",B46)","v":0},0,0,null,null,"","","",""]
[null,null,null,null,null,"",{"$f":"_xlfn.SWITCH(B47,\"(vide)\",\"\",ISBLANK(B47),\"\",B47)","v":0},0,0,null,null,"","","",""]
[null,null,null,null,null,"",{"$f":"_xlfn.SWITCH(B48,\"(vide)\",\"\",ISBLANK(B48),\"\",B48)","v":0},0,0,null,null,"","","",""]
[null,null,null,null,null,"",{"$f":"_xlfn.SWITCH(B49,\"(vide)\",\"\",ISBLANK(B49),\"\",B49)","v":0},0,0,null,null,"","","",""]
[null,null,null,null,null,"",{"$f":"_xlfn.SWITCH(B50,\"(vide)\",\"\",ISBLANK(B50),\"\",B50)","v":0},0,0,null,null,"","","",""]
[null,null,null,null,null,"",{"$f":"_xlfn.SWITCH(B51,\"(vide)\",\"\",ISBLANK(B51),\"\",B51)","v":0},0,0,null,null,"","","",""]
[null,null,null,null,null,"",{"$f":"_xlfn.SWITCH(B52,\"(vide)\",\"\",ISBLANK(B52),\"\",B52)","v":0},0,0,null,null,"","","",""]
[null,null,null,null,null,"",{"$f":"_xlfn.SWITCH(B53,\"(vide)\",\"\",ISBLANK(B53),\"\",B53)","v":0},0,0,null,null,"","","",""]
[null,null,null,null,null,"",{"$f":"_xlfn.SWITCH(B54,\"(vide)\",\"\",ISBLANK(B54),\"\",B54)","v":0},0,0,null,null,"","","",""]
[null,null,null,null,null,"",{"$f":"_xlfn.SWITCH(B55,\"(vide)\",\"\",ISBLANK(B55),\"\",B55)","v":0},0,0,null,null,"","","",""]
[null,null,null,null,null,"",{"$f":"_xlfn.SWITCH(B56,\"(vide)\",\"\",ISBLANK(B56),\"\",B56)","v":0},0,0,null,null,"","","",""]
[null,null,null,null,null,"",{"$f":"_xlfn.SWITCH(B57,\"(vide)\",\"\",ISBLANK(B57),\"\",B57)","v":0},0,0,null,null,"","","",""]
[null,null,null,null,null,"",{"$f":"_xlfn.SWITCH(B58,\"(vide)\",\"\",ISBLANK(B58),\"\",B58)","v":0},0,0,null,null,"","","",""]
[null,null,null,null,null,"",{"$f":"_xlfn.SWITCH(B59,\"(vide)\",\"\",ISBLANK(B59),\"\",B59)","v":0},0,0,null,null,"","","",""]
[null,null,null,null,null,"",{"$f":"_xlfn.SWITCH(B60,\"(vide)\",\"\",ISBLANK(B60),\"\",B60)","v":0},0,0,null,null,"","","",""]
[null,null,null,null,null,"",{"$f":"_xlfn.SWITCH(B61,\"(vide)\",\"\",ISBLANK(B61),\"\",B61)","v":0},0,0,null,null,"","","",""]
[null,null,null,null,null,"",{"$f":"_xlfn.SWITCH(B62,\"(vide)\",\"\",ISBLANK(B62),\"\",B62)","v":0},0,0,null,null,"","","",""]
[null,null,null,null,null,"",{"$f":"_xlfn.SWITCH(B63,\"(vide)\",\"\",ISBLANK(B63),\"\",B63)","v":0},0,0,null,null,"","","",""]
[null,null,null,null,null,"",{"$f":"_xlfn.SWITCH(B64,\"(vide)\",\"\",ISBLANK(B64),\"\",B64)","v":0},0,0,null,null,"","","",""]
[null,null,null,null,null,"",{"$f":"_xlfn.SWITCH(B65,\"(vide)\",\"\",ISBLANK(B65),\"\",B65)","v":0},0,0,null,null,"","","",""]
[null,null,null,null,null,"",{"$f":"_xlfn.SWITCH(B66,\"(vide)\",\"\",ISBLANK(B66),\"\",B66)","v":0},0,0,null,null,"","","",""]
[null,null,null,null,null,{"$f":"IF(A67=\"\",\"\",A67)","v":""},{"$f":"_xlfn.SWITCH(B67,\"(vide)\",\"\",ISBLANK(B67),\"\",B67)","v":0},0,0,null,null,"","","",{"$f":"IF(I67=0,\"\",I67)","v":""}]
[null,null,null,null,null,"",{"$f":"_xlfn.SWITCH(B68,\"(vide)\",\"\",ISBLANK(B68),\"\",B68)","v":0},0,0,null,null,{"$f":"IF(F68=0,\"\",F68)","v":""},"","",""]
[null,null,null,null,null,"",{"$f":"_xlfn.SWITCH(B69,\"(vide)\",\"\",ISBLANK(B69),\"\",B69)","v":0},0,0,null,null,"","","",""]
[null,null,null,null,null,"",{"$f":"_xlfn.SWITCH(B70,\"(vide)\",\"\",ISBLANK(B70),\"\",B70)","v":0},0,0,null,null,"","","",""]
[null,null,null,null,null,"",{"$f":"_xlfn.SWITCH(B71,\"(vide)\",\"\",ISBLANK(B71),\"\",B71)","v":0},0,0,null,null,"","","",""]
[null,null,null,null,null,"",{"$f":"_xlfn.SWITCH(B72,\"(vide)\",\"\",ISBLANK(B72),\"\",B72)","v":0},0,0,null,null,"","","",""]
[null,null,null,null,null,"",{"$f":"_xlfn.SWITCH(B73,\"(vide)\",\"\",ISBLANK(B73),\"\",B73)","v":0},0,0,null,null,"","","",""]
[null,null,null,null,null,"",{"$f":"_xlfn.SWITCH(B74,\"(vide)\",\"\",ISBLANK(B74),\"\",B74)","v":0},0,0,null,null,"","","",""]
[null,null,null,null,null,"",{"$f":"_xlfn.SWITCH(B75,\"(vide)\",\"\",ISBLANK(B75),\"\",B75)","v":0},0,0,null,null,"","","",""]
[null,null,null,null,null,"",{"$f":"_xlfn.SWITCH(B76,\"(vide)\",\"\",ISBLANK(B76),\"\",B76)","v":0},0,0,null,null,"","","",""]
[null,null,null,null,null,"",{"$f":"_xlfn.SWITCH(B77,\"(vide)\",\"\",ISBLANK(B77),\"\",B77)","v":0},0,0,null,null,"","","",""]
[null,null,null,null,null,"",{"$f":"_xlfn.SWITCH(B78,\"(vide)\",\"\",ISBLANK(B78),\"\",B78)","v":0},0,0,null,null,"","","",""]
[null,null,null,null,null,"",{"$f":"_xlfn.SWITCH(B79,\"(vide)\",\"\",ISBLANK(B79),\"\",B79)","v":0},0,0,null,null,"","","",""]
[null,null,null,null,null,"",{"$f":"_xlfn.SWITCH(B80,\"(vide)\",\"\",ISBLANK(B80),\"\",B80)","v":0},0,0,null,null,"","","",""]
[null,null,null,null,null,"",{"$f":"_xlfn.SWITCH(B81,\"(vide)\",\"\",ISBLANK(B81),\"\",B81)","v":0},{"$f":"C81","v":0},0,null,null,"","","",""]
[null,null,null,null,null,"",{"$f":"_xlfn.SWITCH(B82,\"(vide)\",\"\",ISBLANK(B82),\"\",B82)","v":0},0,0,null,null,"","","",""]
[null,null,null,null,null,"",{"$f":"_xlfn.SWITCH(B83,\"(vide)\",\"\",ISBLANK(B83),\"\",B83)","v":0},0,0,null,null,"","","",""]
[null,null,null,null,null,"",{"$f":"_xlfn.SWITCH(B84,\"(vide)\",\"\",ISBLANK(B84),\"\",B84)","v":0},0,0,null,null,"","","",""]
[null,null,null,null,null,"",{"$f":"_xlfn.SWITCH(B85,\"(vide)\",\"\",ISBLANK(B85),\"\",B85)","v":0},0,0,null,null,"","","",""]
[null,null,null,null,null,"",{"$f":"_xlfn.SWITCH(B86,\"(vide)\",\"\",ISBLANK(B86),\"\",B86)","v":0},0,0,null,null,"","","",""]
[null,null,null,null,null,"",{"$f":"_xlfn.SWITCH(B87,\"(vide)\",\"\",ISBLANK(B87),\"\",B87)","v":0},0,0,null,null,"","","",""]
[null,null,null,null,null,"",{"$f":"_xlfn.SWITCH(B88,\"(vide)\",\"\",ISBLANK(B88),\"\",B88)","v":0},0,0,null,null,"","","",""]
[null,null,null,null,null,"",{"$f":"_xlfn.SWITCH(B89,\"(vide)\",\"\",ISBLANK(B89),\"\",B89)","v":0},0,0,null,null,"","","",""]
[null,null,null,null,null,"",{"$f":"_xlfn.SWITCH(B90,\"(vide)\",\"\",ISBLANK(B90),\"\",B90)","v":0},0,0,null,null,"","","",""]
[null,null,null,null,null,"",{"$f":"_xlfn.SWITCH(B91,\"(vide)\",\"\",ISBLANK(B91),\"\",B91)","v":0},0,0,null,null,"","","",""]
[null,null,null,null,null,"",{"$f":"_xlfn.SWITCH(B92,\"(vide)\",\"\",ISBLANK(B92),\"\",B92)","v":0},0,0,null,null,"","","",""]
[null,null,null,null,null,"",{"$f":"_xlfn.SWITCH(B93,\"(vide)\",\"\",ISBLANK(B93),\"\",B93)","v":0},0,0,null,null,"","","",""]
[null,null,null,null,null,"",{"$f":"_xlfn.SWITCH(B94,\"(vide)\",\"\",ISBLANK(B94),\"\",B94)","v":0},0,0,null,null,"","","",""]
[null,null,null,null,null,"",{"$f":"_xlfn.SWITCH(B95,\"(vide)\",\"\",ISBLANK(B95),\"\",B95)","v":0},0,0,null,null,"","","",""]
[null,null,null,null,null,"",{"$f":"_xlfn.SWITCH(B96,\"(vide)\",\"\",ISBLANK(B96),\"\",B96)","v":0},0,0,null,null,"","","",""]
[null,null,null,null,null,"",{"$f":"_xlfn.SWITCH(B97,\"(vide)\",\"\",ISBLANK(B97),\"\",B97)","v":0},0,0,null,null,"","","",""]
[null,null,null,null,null,"",{"$f":"_xlfn.SWITCH(B98,\"(vide)\",\"\",ISBLANK(B98),\"\",B98)","v":0},0,0,null,null,"","","",""]
[null,null,null,null,null,"",{"$f":"_xlfn.SWITCH(B99,\"(vide)\",\"\",ISBLANK(B99),\"\",B99)","v":0},0,0,null,null,"","","",""]
[null,null,null,null,null,"",{"$f":"_xlfn.SWITCH(B100,\"(vide)\",\"\",ISBLANK(B100),\"\",B100)","v":0},0,0,null,null,"","","",""]
[null,null,null,null,null,"",{"$f":"_xlfn.SWITCH(B101,\"(vide)\",\"\",ISBLANK(B101),\"\",B101)","v":0},0,0,null,null,"","","",""]
[null,null,null,null,null,"",{"$f":"_xlfn.SWITCH(B102,\"(vide)\",\"\",ISBLANK(B102),\"\",B102)","v":0},0,0,null,null,"","","",""]
[null,null,null,null,null,"",{"$f":"_xlfn.SWITCH(B103,\"(vide)\",\"\",ISBLANK(B103),\"\",B103)","v":0},0,0,null,null,"","","",""]
[null,null,null,null,null,"",{"$f":"_xlfn.SWITCH(B104,\"(vide)\",\"\",ISBLANK(B104),\"\",B104)","v":0},0,0,null,null,"","","",""]
[null,null,null,null,null,"",{"$f":"_xlfn.SWITCH(B105,\"(vide)\",\"\",ISBLANK(B105),\"\",B105)","v":0},0,0,null,null,"","","",""]
[null,null,null,null,null,"",{"$f":"_xlfn.SWITCH(B106,\"(vide)\",\"\",ISBLANK(B106),\"\",B106)","v":0},0,0,null,null,"","","",""]
[null,null,null,null,null,"",{"$f":"_xlfn.SWITCH(B107,\"(vide)\",\"\",ISBLANK(B107),\"\",B107)","v":0},0,0,null,null,"","","",""]
[null,null,null,null,null,"",{"$f":"_xlfn.SWITCH(B108,\"(vide)\",\"\",ISBLANK(B108),\"\",B108)","v":0},0,0,null,null,"","","",""]
[null,null,null,null,null,"",{"$f":"_xlfn.SWITCH(B109,\"(vide)\",\"\",ISBLANK(B109),\"\",B109)","v":0},0,0,null,null,"","","",""]
[null,null,null,null,null,"",{"$f":"_xlfn.SWITCH(B110,\"(vide)\",\"\",ISBLANK(B110),\"\",B110)","v":0},0,0,null,null,"","","",""]
[null,null,null,null,null,"",{"$f":"_xlfn.SWITCH(B111,\"(vide)\",\"\",ISBLANK(B111),\"\",B111)","v":0},0,0,null,null,"","","",""]
[null,null,null,null,null,"",{"$f":"_xlfn.SWITCH(B112,\"(vide)\",\"\",ISBLANK(B112),\"\",B112)","v":0},0,0,null,null,"","","",""]
[null,null,null,null,null,"",{"$f":"_xlfn.SWITCH(B113,\"(vide)\",\"\",ISBLANK(B113),\"\",B113)","v":0},0,0,null,null,"","","",""]
[null,null,null,null,null,"",{"$f":"_xlfn.SWITCH(B114,\"(vide)\",\"\",ISBLANK(B114),\"\",B114)","v":0},0,0,null,null,"","","",""]
[null,null,null,null,null,"",{"$f":"_xlfn.SWITCH(B115,\"(vide)\",\"\",ISBLANK(B115),\"\",B115)","v":0},0,0,null,null,"","","",""]
[null,null,null,null,null,"",{"$f":"_xlfn.SWITCH(B116,\"(vide)\",\"\",ISBLANK(B116),\"\",B116)","v":0},0,0,null,null,"","","",""]
[null,null,null,null,null,"",{"$f":"_xlfn.SWITCH(B117,\"(vide)\",\"\",ISBLANK(B117),\"\",B117)","v":0},0,0,null,null,"","","",""]
[null,null,null,null,null,"",{"$f":"_xlfn.SWITCH(B118,\"(vide)\",\"\",ISBLANK(B118),\"\",B118)","v":0},0,0,null,null,"","","",""]
[null,null,null,null,null,"",{"$f":"_xlfn.SWITCH(B119,\"(vide)\",\"\",ISBLANK(B119),\"\",B119)","v":0},0,0,null,null,"","","",""]
[null,null,null,null,null,"",{"$f":"_xlfn.SWITCH(B120,\"(vide)\",\"\",ISBLANK(B120),\"\",B120)","v":0},0,0,null,null,"","","",""]
[null,null,null,null,null,"",{"$f":"_xlfn.SWITCH(B121,\"(vide)\",\"\",ISBLANK(B121),\"\",B121)","v":0},0,0,null,null,"","","",""]
[null,null,null,null,null,"",{"$f":"_xlfn.SWITCH(B122,\"(vide)\",\"\",ISBLANK(B122),\"\",B122)","v":0},0,0,null,null,"","","",""]
[null,null,null,null,null,"",{"$f":"_xlfn.SWITCH(B123,\"(vide)\",\"\",ISBLANK(B123),\"\",B123)","v":0},0,0,null,null,"","","",""]
[null,null,null,null,null,"",{"$f":"_xlfn.SWITCH(B124,\"(vide)\",\"\",ISBLANK(B124),\"\",B124)","v":0},0,0,null,null,"","","",""]
[null,null,null,null,null,"",{"$f":"_xlfn.SWITCH(B125,\"(vide)\",\"\",ISBLANK(B125),\"\",B125)","v":0},0,0,null,null,"","","",""]
[null,null,null,null,null,"",{"$f":"_xlfn.SWITCH(B126,\"(vide)\",\"\",ISBLANK(B126),\"\",B126)","v":0},0,0,null,null,"","","",""]
[null,null,null,null,null,"",{"$f":"_xlfn.SWITCH(B127,\"(vide)\",\"\",ISBLANK(B127),\"\",B127)","v":0},0,0,null,null,"","","",""]
[null,null,null,null,null,"",{"$f":"_xlfn.SWITCH(B128,\"(vide)\",\"\",ISBLANK(B128),\"\",B128)","v":0},0,0,null,null,"","","",""]
[null,null,null,null,null,"",{"$f":"_xlfn.SWITCH(B129,\"(vide)\",\"\",ISBLANK(B129),\"\",B129)","v":0},0,0,null,null,"","","",""]
[null,null,null,null,null,"",{"$f":"_xlfn.SWITCH(B130,\"(vide)\",\"\",ISBLANK(B130),\"\",B130)","v":0},0,0,null,null,"","","",""]
[null,null,null,null,null,{"$f":"IF(A131=\"\",\"\",A131)","v":""},{"$f":"_xlfn.SWITCH(B131,\"(vide)\",\"\",ISBLANK(B131),\"\",B131)","v":0},0,0,null,null,"","","",""]
[null,null,null,null,null,"",{"$f":"_xlfn.SWITCH(B132,\"(vide)\",\"\",ISBLANK(B132),\"\",B132)","v":0},0,0,null,null,{"$f":"IF(F132=0,\"\",F132)","v":""},"","",""]
[null,null,null,null,null,"",{"$f":"_xlfn.SWITCH(B133,\"(vide)\",\"\",ISBLANK(B133),\"\",B133)","v":0},0,0,null,null,"","","",""]
[null,null,null,null,null,"",{"$f":"_xlfn.SWITCH(B134,\"(vide)\",\"\",ISBLANK(B134),\"\",B134)","v":0},0,0,null,null,"","","",""]
[null,null,null,null,null,"",{"$f":"_xlfn.SWITCH(B135,\"(vide)\",\"\",ISBLANK(B135),\"\",B135)","v":0},0,0,null,null,"","","",""]
[null,null,null,null,null,"",{"$f":"_xlfn.SWITCH(B136,\"(vide)\",\"\",ISBLANK(B136),\"\",B136)","v":0},0,0,null,null,"","","",""]
[null,null,null,null,null,"",{"$f":"_xlfn.SWITCH(B137,\"(vide)\",\"\",ISBLANK(B137),\"\",B137)","v":0},0,0,null,null,"","","",""]
[null,null,null,null,null,"",{"$f":"_xlfn.SWITCH(B138,\"(vide)\",\"\",ISBLANK(B138),\"\",B138)","v":0},0,0,null,null,"","","",""]
[null,null,null,null,null,"",{"$f":"_xlfn.SWITCH(B139,\"(vide)\",\"\",ISBLANK(B139),\"\",B139)","v":0},0,0,null,null,"","","",""]
[null,null,null,null,null,"",{"$f":"_xlfn.SWITCH(B140,\"(vide)\",\"\",ISBLANK(B140),\"\",B140)","v":0},0,0,null,null,"","","",""]
[null,null,null,null,null,"",{"$f":"_xlfn.SWITCH(B141,\"(vide)\",\"\",ISBLANK(B141),\"\",B141)","v":0},0,0,null,null,"","","",""]
[null,null,null,null,null,"",{"$f":"_xlfn.SWITCH(B142,\"(vide)\",\"\",ISBLANK(B142),\"\",B142)","v":0},0,0,null,null,"","","",""]

{"sheet":"PdlL","index":28,"n_rows":1,"n_cols":1,"rows_kept":1,"cut":false,"hidden":false,"merged":[[0,0,2,22]]}
["REGION\nPAYS DE LA LOIRE"]

{"sheet":"Occ","index":29,"n_rows":1,"n_cols":1,"rows_kept":1,"cut":false,"hidden":false,"merged":[[0,0,2,22]]}
["REGION\nOCCITANIE"]